{"text_format":"1","workbook":"xlsx","n_sheets":18,"sheets":["Start","Resultat","RS","Sorterat","Stn 18","Vattenföring","Statistik","Diagram","Hist_data","Rapport","Kommentarer","Kontakt","Länkar","Förklaring","Versionshistorik","Makron m m","Provpunkter","Formler"],"not_rendered":{"charts":23,"images":22,"macros":1,"external_links":0,"defined_names":5,"comments":7,"pivot_tables":0},"unopened":[],"bounds":{"document_bytes":16777216,"sheet_cells":100000,"rows_first":2000,"rows_last":500,"rows_between":2000,"halvings":0,"cell_chars":16384,"cell_head_chars":4096},"cells_cut":0,"cells_raw":0,"read":"whole","date_system":"1900"}

{"sheet":"Start","index":0,"n_rows":15,"n_cols":8,"rows_kept":15,"cut":false,"hidden":false,"merged":[]}
[]
[]
[null,null,null,null,"Sege å - vattenkontroll 2021"]
[]
[]
[null,"Foto: ??"]
[null,null,"Resultat sorterat per månad",null,"Resultat sorterat per provpunkt",null,null,"Diagram och statistik"]
[]
[null,null,"Resultat veckoprov"]
[]
[null,null,"Månadsrapport",null,"Kommentarer",null,null,"Vattenföring"]
[]
[null,null,"Länkar",null,"Kontakt",null,null,"Användarguide"]
[]
[null,null,"På uppdrag av Segeåns Vattendragsförbund och Vattenråd"]

{"sheet":"Resultat","index":1,"n_rows":109,"n_cols":21,"rows_kept":109,"cut":false,"hidden":false,"merged":[]}
[null,"Sege å 2021\nResultat"]
[null,null,null,"Peka på röda trianglar (►) för förklaring av parametrar"]
["Sorterings-","Provtagningspunkt","Provtagn"," Vattenf"," Temp"," Syreh","Syrem","  pH","Gruml","  Kond","BOD7","TOC","Tot-P"," NO3+2-N","NH4-N"," Tot-N","Klor a","Siktdj VK","Siktdj","   Tid","Anmärkning"]
["ordning","Nr Läge","datum","    m3/s","  °C","mg/l","%",null,"  FNU","mS/m","mg/l","mg/l"," µg/l","  µg/l","  µg/l","  µg/l","mg/m3","m","m"]
[250,"februari"]
[3,"1  Sege å, vid Brännemölla, uppströms Svedala AR","2021-02-15","",0.4,14,97,7.78,12,50.4,4.9000000000000004,22,65,1800,250,3600,{"$f":"IF(Rapport!Q10=\"\",\"\",Rapport!Q10)","v":""},{"$f":"IF(Rapport!R10=\"\",\"\",Rapport!R10)","v":""},{"$f":"IF(Rapport!S10=\"\",\"\",Rapport!S10)","v":""},{"$f":"IF(Rapport!T10=\"\",\"\",Rapport!T10)","v":1545},{"$f":"IF(Rapport!U10=\"\",\"\",Rapport!U10)","v":"is i kanten "}]
[5,"2  Sege å, söder Krågeholm, nedströms Svedala AR","2021-02-15",0.49,1.2,13.5,95,7.8,15,54.2,5,19,86,2900,300,4100,{"$f":"IF(Rapport!Q11=\"\",\"\",Rapport!Q11)","v":""},{"$f":"IF(Rapport!R11=\"\",\"\",Rapport!R11)","v":""},{"$f":"IF(Rapport!S11=\"\",\"\",Rapport!S11)","v":""},{"$f":"IF(Rapport!T11=\"\",\"\",Rapport!T11)","v":1600},{"$f":"IF(Rapport!U11=\"\",\"\",Rapport!U11)","v":"is i kanten "}]
[7,"9  Sege å, vid Lilla Mölleberga","2021-02-15","",0,14,96,7.92,11,68.3,"",16,83,3300,300,3900,{"$f":"IF(Rapport!Q12=\"\",\"\",Rapport!Q12)","v":""},{"$f":"IF(Rapport!R12=\"\",\"\",Rapport!R12)","v":""},{"$f":"IF(Rapport!S12=\"\",\"\",Rapport!S12)","v":""},{"$f":"IF(Rapport!T12=\"\",\"\",Rapport!T12)","v":1445},{"$f":"IF(Rapport!U12=\"\",\"\",Rapport!U12)","v":"istäckt"}]
[9,"18 Sege å, nordväst Valdemarsro, järnvägsbron","2021-02-15","",0.1,13.5,92,7.89,14,78.2,"",14,99,4300,240,4800,{"$f":"IF(Rapport!Q13=\"\",\"\",Rapport!Q13)","v":""},{"$f":"IF(Rapport!R13=\"\",\"\",Rapport!R13)","v":""},{"$f":"IF(Rapport!S13=\"\",\"\",Rapport!S13)","v":""},{"$f":"IF(Rapport!T13=\"\",\"\",Rapport!T13)","v":1400},{"$f":"IF(Rapport!U13=\"\",\"\",Rapport!U13)","v":"is i kanten "}]
[11,"21 Spångholmsbäcken, vid utlopp till Sege å","2021-02-15","",0,13.5,92,7.9,11,68.7,"",16,72,1500,640,3100,{"$f":"IF(Rapport!Q14=\"\",\"\",Rapport!Q14)","v":""},{"$f":"IF(Rapport!R14=\"\",\"\",Rapport!R14)","v":""},{"$f":"IF(Rapport!S14=\"\",\"\",Rapport!S14)","v":""},{"$f":"IF(Rapport!T14=\"\",\"\",Rapport!T14)","v":1500},{"$f":"IF(Rapport!U14=\"\",\"\",Rapport!U14)","v":"istäckt"}]
[13,"22b Spångholmsbäcken, bron vid Torupsvägen","2021-02-15","",0.1,13.8,95,7.91,6.6,62.9,"",18,55,1400,910,3000,{"$f":"IF(Rapport!Q15=\"\",\"\",Rapport!Q15)","v":""},{"$f":"IF(Rapport!R15=\"\",\"\",Rapport!R15)","v":""},{"$f":"IF(Rapport!S15=\"\",\"\",Rapport!S15)","v":""},{"$f":"IF(Rapport!T15=\"\",\"\",Rapport!T15)","v":1510},{"$f":"IF(Rapport!U15=\"\",\"\",Rapport!U15)","v":"is i kanten "}]
[15,"23 Spångholmsbäcken, uppströms Torupsdammen","2021-02-15","",0,14.3,98,8.01,10,59,"",18,62,760,980,3000,{"$f":"IF(Rapport!Q16=\"\",\"\",Rapport!Q16)","v":""},{"$f":"IF(Rapport!R16=\"\",\"\",Rapport!R16)","v":""},{"$f":"IF(Rapport!S16=\"\",\"\",Rapport!S16)","v":""},{"$f":"IF(Rapport!T16=\"\",\"\",Rapport!T16)","v":1520},{"$f":"IF(Rapport!U16=\"\",\"\",Rapport!U16)","v":"istäckt"}]
[17,"10 Torrebergabäcken, vägbron nordost Mölleberga","2021-02-15","",0,11.5,79,7.67,9.6,78.900000000000006,"",12,140,6900,210,6700,{"$f":"IF(Rapport!Q17=\"\",\"\",Rapport!Q17)","v":""},{"$f":"IF(Rapport!R17=\"\",\"\",Rapport!R17)","v":""},{"$f":"IF(Rapport!S17=\"\",\"\",Rapport!S17)","v":""},{"$f":"IF(Rapport!T17=\"\",\"\",Rapport!T17)","v":1430},{"$f":"IF(Rapport!U17=\"\",\"\",Rapport!U17)","v":"istäckt"}]
[18,"15 Risebergabäcken, ca 250 m uppströms från Sege å","2021-02-15","",0.9,14.5,102,8.24,2.6,115,"",5.2,31,1600,37,3600,{"$f":"IF(Rapport!Q18=\"\",\"\",Rapport!Q18)","v":""},{"$f":"IF(Rapport!R18=\"\",\"\",Rapport!R18)","v":""},{"$f":"IF(Rapport!S18=\"\",\"\",Rapport!S18)","v":""},{"$f":"IF(Rapport!T18=\"\",\"\",Rapport!T18)","v":1410},{"$f":"IF(Rapport!U18=\"\",\"\",Rapport!U18)","v":""}]
[30,"A1 Alnarpsån, mynningen","2021-02-15","",0.1,13.3,91,7.92,18,113,"",5.6,63,5700,160,5800,{"$f":"IF(Rapport!Q19=\"\",\"\",Rapport!Q19)","v":""},{"$f":"IF(Rapport!R19=\"\",\"\",Rapport!R19)","v":""},{"$f":"IF(Rapport!S19=\"\",\"\",Rapport!S19)","v":""},{"$f":"IF(Rapport!T19=\"\",\"\",Rapport!T19)","v":1315},{"$f":"IF(Rapport!U19=\"\",\"\",Rapport!U19)","v":"istäckt"}]
[32,"A4 Alnarpsån, Coyetgården","2021-02-15","",0.1,18.5,127,8.36,8,88.1,"",3.4,130,6100,300,6300,{"$f":"IF(Rapport!Q20=\"\",\"\",Rapport!Q20)","v":""},{"$f":"IF(Rapport!R20=\"\",\"\",Rapport!R20)","v":""},{"$f":"IF(Rapport!S20=\"\",\"\",Rapport!S20)","v":""},{"$f":"IF(Rapport!T20=\"\",\"\",Rapport!T20)","v":1330},{"$f":"IF(Rapport!U20=\"\",\"\",Rapport!U20)","v":"istäckt"}]
[200]
[250,"april"]
[3,"1  Sege å, vid Brännemölla, uppströms Svedala AR","2021-04-19","",9.8000000000000007,11.2,99,7.81,11,47.7,6.3,22,66,1300,"<10",2900,{"$f":"IF(Rapport!Q23=\"\",\"\",Rapport!Q23)","v":""},{"$f":"IF(Rapport!R23=\"\",\"\",Rapport!R23)","v":""},{"$f":"IF(Rapport!S23=\"\",\"\",Rapport!S23)","v":""},{"$f":"IF(Rapport!T23=\"\",\"\",Rapport!T23)","v":1050},{"$f":"IF(Rapport!U23=\"\",\"\",Rapport!U23)","v":"grumligt "}]
[5,"2  Sege å, söder Krågeholm, nedströms Svedala AR","2021-04-19",0.41,9.5,12,105,7.89,11,56.8,6.1,18,69,2100,68,3400,{"$f":"IF(Rapport!Q24=\"\",\"\",Rapport!Q24)","v":""},{"$f":"IF(Rapport!R24=\"\",\"\",Rapport!R24)","v":""},{"$f":"IF(Rapport!S24=\"\",\"\",Rapport!S24)","v":""},{"$f":"IF(Rapport!T24=\"\",\"\",Rapport!T24)","v":1030},{"$f":"IF(Rapport!U24=\"\",\"\",Rapport!U24)","v":"grumligt "}]
[7,"9  Sege å, vid Lilla Mölleberga","2021-04-19","",9.5,11,97,8,8.1999999999999993,63.8,"",15,77,2100,"<10",2900,{"$f":"IF(Rapport!Q25=\"\",\"\",Rapport!Q25)","v":""},{"$f":"IF(Rapport!R25=\"\",\"\",Rapport!R25)","v":""},{"$f":"IF(Rapport!S25=\"\",\"\",Rapport!S25)","v":""},{"$f":"IF(Rapport!T25=\"\",\"\",Rapport!T25)","v":920},{"$f":"IF(Rapport!U25=\"\",\"\",Rapport!U25)","v":""}]
[9,"18 Sege å, nordväst Valdemarsro, järnvägsbron","2021-04-19","",9.5,10.4,91,8,6.7,70.099999999999994,"",13,62,2400,14,3200,{"$f":"IF(Rapport!Q26=\"\",\"\",Rapport!Q26)","v":""},{"$f":"IF(Rapport!R26=\"\",\"\",Rapport!R26)","v":""},{"$f":"IF(Rapport!S26=\"\",\"\",Rapport!S26)","v":""},{"$f":"IF(Rapport!T26=\"\",\"\",Rapport!T26)","v":840},{"$f":"IF(Rapport!U26=\"\",\"\",Rapport!U26)","v":""}]
[11,"21 Spångholmsbäcken, vid utlopp till Sege å","2021-04-19","",8.6,11,95,7.85,7,63.9,"",15,60,1200,50,2100,{"$f":"IF(Rapport!Q27=\"\",\"\",Rapport!Q27)","v":""},{"$f":"IF(Rapport!R27=\"\",\"\",Rapport!R27)","v":""},{"$f":"IF(Rapport!S27=\"\",\"\",Rapport!S27)","v":""},{"$f":"IF(Rapport!T27=\"\",\"\",Rapport!T27)","v":930},{"$f":"IF(Rapport!U27=\"\",\"\",Rapport!U27)","v":""}]
[13,"22b Spångholmsbäcken, bron vid Torupsvägen","2021-04-19","",9.1,11.5,100,7.83,4.3,58.8,"",18,52,1200,180,2300,{"$f":"IF(Rapport!Q28=\"\",\"\",Rapport!Q28)","v":""},{"$f":"IF(Rapport!R28=\"\",\"\",Rapport!R28)","v":""},{"$f":"IF(Rapport!S28=\"\",\"\",Rapport!S28)","v":""},{"$f":"IF(Rapport!T28=\"\",\"\",Rapport!T28)","v":950},{"$f":"IF(Rapport!U28=\"\",\"\",Rapport!U28)","v":""}]
[15,"23 Spångholmsbäcken, uppströms Torupsdammen","2021-04-19","",9.4,11.1,97,7.99,3.1,56.4,"",18,53,590,410,2100,{"$f":"IF(Rapport!Q29=\"\",\"\",Rapport!Q29)","v":""},{"$f":"IF(Rapport!R29=\"\",\"\",Rapport!R29)","v":""},{"$f":"IF(Rapport!S29=\"\",\"\",Rapport!S29)","v":""},{"$f":"IF(Rapport!T29=\"\",\"\",Rapport!T29)","v":1010},{"$f":"IF(Rapport!U29=\"\",\"\",Rapport!U29)","v":""}]
[17,"10 Torrebergabäcken, vägbron nordost Mölleberga","2021-04-19","",8.9,9.8000000000000007,85,7.84,5.3,66,"",14,66,2900,20,3600,{"$f":"IF(Rapport!Q30=\"\",\"\",Rapport!Q30)","v":""},{"$f":"IF(Rapport!R30=\"\",\"\",Rapport!R30)","v":""},{"$f":"IF(Rapport!S30=\"\",\"\",Rapport!S30)","v":""},{"$f":"IF(Rapport!T30=\"\",\"\",Rapport!T30)","v":910},{"$f":"IF(Rapport!U30=\"\",\"\",Rapport!U30)","v":""}]
[18,"15 Risebergabäcken, ca 250 m uppströms från Sege å","2021-04-19","",9.5,12.2,107,8.06,3.2,104,"",5.5,32,2000,37,2300,{"$f":"IF(Rapport!Q31=\"\",\"\",Rapport!Q31)","v":""},{"$f":"IF(Rapport!R31=\"\",\"\",Rapport!R31)","v":""},{"$f":"IF(Rapport!S31=\"\",\"\",Rapport!S31)","v":""},{"$f":"IF(Rapport!T31=\"\",\"\",Rapport!T31)","v":850},{"$f":"IF(Rapport!U31=\"\",\"\",Rapport!U31)","v":""}]
[30,"A1 Alnarpsån, mynningen","2021-04-19","",6.6,18.5,151,7.73,5.4,100,"",6,52,3400,26,3900,{"$f":"IF(Rapport!Q32=\"\",\"\",Rapport!Q32)","v":""},{"$f":"IF(Rapport!R32=\"\",\"\",Rapport!R32)","v":""},{"$f":"IF(Rapport!S32=\"\",\"\",Rapport!S32)","v":""},{"$f":"IF(Rapport!T32=\"\",\"\",Rapport!T32)","v":800},{"$f":"IF(Rapport!U32=\"\",\"\",Rapport!U32)","v":""}]
[32,"A4 Alnarpsån, Coyetgården","2021-04-19","",8.6,8.6,74,8.17,1.4,86.1,"",3.2,16,3800,"<10",4400,{"$f":"IF(Rapport!Q33=\"\",\"\",Rapport!Q33)","v":""},{"$f":"IF(Rapport!R33=\"\",\"\",Rapport!R33)","v":""},{"$f":"IF(Rapport!S33=\"\",\"\",Rapport!S33)","v":""},{"$f":"IF(Rapport!T33=\"\",\"\",Rapport!T33)","v":815},{"$f":"IF(Rapport!U33=\"\",\"\",Rapport!U33)","v":""}]
[200,null,null,null,null,null,null,null,null,null,null,null,null,null,null,"",{"$f":"IF(Rapport!Q34=\"\",\"\",Rapport!Q34)","v":""},{"$f":"IF(Rapport!R34=\"\",\"\",Rapport!R34)","v":""},{"$f":"IF(Rapport!S34=\"\",\"\",Rapport!S34)","v":""},{"$f":"IF(Rapport!T34=\"\",\"\",Rapport!T34)","v":""}]
[250,"maj"]
[20,"31 Börringesjön","2021-05-17","",16.3,13.3,136,8.82,36,38.6,"",20,77,"<10","<10",2300,{"$f":"IF(Rapport!Q36=\"\",\"\",Rapport!Q36)","v":62},{"$f":"IF(Rapport!R36=\"\",\"\",Rapport!R36)","v":0.3},{"$f":"IF(Rapport!S36=\"\",\"\",Rapport!S36)","v":0.3},{"$f":"IF(Rapport!T36=\"\",\"\",Rapport!T36)","v":1000},{"$f":"IF(Rapport!U36=\"\",\"\",Rapport!U36)","v":"gröngrumligt"}]
[22,"32 Fjällfotasjön","2021-05-17","",16.399999999999999,10.6,109,8.8699999999999992,8.9,31.4,"",25,52,"<10","<10",1900,{"$f":"IF(Rapport!Q37=\"\",\"\",Rapport!Q37)","v":28},{"$f":"IF(Rapport!R37=\"\",\"\",Rapport!R37)","v":0.6},{"$f":"IF(Rapport!S37=\"\",\"\",Rapport!S37)","v":0.6},{"$f":"IF(Rapport!T37=\"\",\"\",Rapport!T37)","v":930},{"$f":"IF(Rapport!U37=\"\",\"\",Rapport!U37)","v":"brungrumligt"}]
[24,"33 Yddingen","2021-05-17","",16.100000000000001,13.4,136,8.75,14,49.5,"",21,40,"<10","<10",2000,{"$f":"IF(Rapport!Q38=\"\",\"\",Rapport!Q38)","v":90},{"$f":"IF(Rapport!R38=\"\",\"\",Rapport!R38)","v":0.55000000000000004},{"$f":"IF(Rapport!S38=\"\",\"\",Rapport!S38)","v":0.5},{"$f":"IF(Rapport!T38=\"\",\"\",Rapport!T38)","v":800},{"$f":"IF(Rapport!U38=\"\",\"\",Rapport!U38)","v":"gulgrumligt"}]
[26,"34 Havgårdssjön","2021-05-17","",16.100000000000001,9.3000000000000007,95,8.31,3.7,30.8,"",7.6,42,180,39,1000,{"$f":"IF(Rapport!Q39=\"\",\"\",Rapport!Q39)","v":4.2},{"$f":"IF(Rapport!R39=\"\",\"\",Rapport!R39)","v":2},{"$f":"IF(Rapport!S39=\"\",\"\",Rapport!S39)","v":1.8},{"$f":"IF(Rapport!T39=\"\",\"\",Rapport!T39)","v":1030},{"$f":"IF(Rapport!U39=\"\",\"\",Rapport!U39)","v":"ganska klart vatten"}]
[200]
[250,"juni"]
[3,"1  Sege å, vid Brännemölla, uppströms Svedala AR","2021-06-15","",16.399999999999999,4.3,44,7.41,18,45.3,7.7,26,160,590,250,3300,{"$f":"IF(Rapport!Q42=\"\",\"\",Rapport!Q42)","v":""},{"$f":"IF(Rapport!R42=\"\",\"\",Rapport!R42)","v":""},{"$f":"IF(Rapport!S42=\"\",\"\",Rapport!S42)","v":""},{"$f":"IF(Rapport!T42=\"\",\"\",Rapport!T42)","v":1000},{"$f":"IF(Rapport!U42=\"\",\"\",Rapport!U42)","v":"grumligt"}]
[5,"2  Sege å, söder Krågeholm, nedströms Svedala AR","2021-06-15",0.06,16.399999999999999,8,82,7.76,15,63.8,7.6,16,150,1100,700,3400,{"$f":"IF(Rapport!Q43=\"\",\"\",Rapport!Q43)","v":""},{"$f":"IF(Rapport!R43=\"\",\"\",Rapport!R43)","v":""},{"$f":"IF(Rapport!S43=\"\",\"\",Rapport!S43)","v":""},{"$f":"IF(Rapport!T43=\"\",\"\",Rapport!T43)","v":1020},{"$f":"IF(Rapport!U43=\"\",\"\",Rapport!U43)","v":"grumligt"}]
[7,"9  Sege å, vid Lilla Mölleberga","2021-06-15","",16.600000000000001,7.6,78,7.81,8.8000000000000007,65.599999999999994,"",13,120,1100,39,2100,{"$f":"IF(Rapport!Q44=\"\",\"\",Rapport!Q44)","v":""},{"$f":"IF(Rapport!R44=\"\",\"\",Rapport!R44)","v":""},{"$f":"IF(Rapport!S44=\"\",\"\",Rapport!S44)","v":""},{"$f":"IF(Rapport!T44=\"\",\"\",Rapport!T44)","v":845},{"$f":"IF(Rapport!U44=\"\",\"\",Rapport!U44)","v":""}]
[9,"18 Sege å, nordväst Valdemarsro, järnvägsbron","2021-06-15","",17.2,5.7,59,7.78,4.0999999999999996,73.5,"",12,94,850,87,1700,{"$f":"IF(Rapport!Q45=\"\",\"\",Rapport!Q45)","v":""},{"$f":"IF(Rapport!R45=\"\",\"\",Rapport!R45)","v":""},{"$f":"IF(Rapport!S45=\"\",\"\",Rapport!S45)","v":""},{"$f":"IF(Rapport!T45=\"\",\"\",Rapport!T45)","v":810},{"$f":"IF(Rapport!U45=\"\",\"\",Rapport!U45)","v":""}]
[11,"21 Spångholmsbäcken, vid utlopp till Sege å","2021-06-15","",14.6,6.2,61,7.7,7.7,77.5,"",8.6,120,1000,91,1700,{"$f":"IF(Rapport!Q46=\"\",\"\",Rapport!Q46)","v":""},{"$f":"IF(Rapport!R46=\"\",\"\",Rapport!R46)","v":""},{"$f":"IF(Rapport!S46=\"\",\"\",Rapport!S46)","v":""},{"$f":"IF(Rapport!T46=\"\",\"\",Rapport!T46)","v":900},{"$f":"IF(Rapport!U46=\"\",\"\",Rapport!U46)","v":""}]
[13,"22b Spångholmsbäcken, bron vid Torupsvägen","2021-06-15","",14.5,5.4,53,7.68,5.8,74.8,"",11,76,1900,130,4100,{"$f":"IF(Rapport!Q47=\"\",\"\",Rapport!Q47)","v":""},{"$f":"IF(Rapport!R47=\"\",\"\",Rapport!R47)","v":""},{"$f":"IF(Rapport!S47=\"\",\"\",Rapport!S47)","v":""},{"$f":"IF(Rapport!T47=\"\",\"\",Rapport!T47)","v":920},{"$f":"IF(Rapport!U47=\"\",\"\",Rapport!U47)","v":""}]
[15,"23 Spångholmsbäcken, uppströms Torupsdammen","2021-06-15","",14.6,3.9,38,7.58,5.3,65,"",15,220,45,570,1700,{"$f":"IF(Rapport!Q48=\"\",\"\",Rapport!Q48)","v":""},{"$f":"IF(Rapport!R48=\"\",\"\",Rapport!R48)","v":""},{"$f":"IF(Rapport!S48=\"\",\"\",Rapport!S48)","v":""},{"$f":"IF(Rapport!T48=\"\",\"\",Rapport!T48)","v":940},{"$f":"IF(Rapport!U48=\"\",\"\",Rapport!U48)","v":""}]
[17,"10 Torrebergabäcken, vägbron nordost Mölleberga","2021-06-15","",17.100000000000001,3.4,35,7.52,11,64.8,"",12,150,750,100,1700,{"$f":"IF(Rapport!Q49=\"\",\"\",Rapport!Q49)","v":""},{"$f":"IF(Rapport!R49=\"\",\"\",Rapport!R49)","v":""},{"$f":"IF(Rapport!S49=\"\",\"\",Rapport!S49)","v":""},{"$f":"IF(Rapport!T49=\"\",\"\",Rapport!T49)","v":830},{"$f":"IF(Rapport!U49=\"\",\"\",Rapport!U49)","v":""}]
[18,"15 Risebergabäcken, ca 250 m uppströms från Sege å","2021-06-15","",13.8,8.5,82,8,5.5,111,"",4.0999999999999996,63,1100,140,1600,{"$f":"IF(Rapport!Q50=\"\",\"\",Rapport!Q50)","v":""},{"$f":"IF(Rapport!R50=\"\",\"\",Rapport!R50)","v":""},{"$f":"IF(Rapport!S50=\"\",\"\",Rapport!S50)","v":""},{"$f":"IF(Rapport!T50=\"\",\"\",Rapport!T50)","v":820},{"$f":"IF(Rapport!U50=\"\",\"\",Rapport!U50)","v":""}]
[20,"31 Börringesjön","2021-06-14","",19.2,9.6999999999999993,105,8.67,42,39.299999999999997,"",26,96,"<10","<10",2800,{"$f":"IF(Rapport!Q51=\"\",\"\",Rapport!Q51)","v":54},{"$f":"IF(Rapport!R51=\"\",\"\",Rapport!R51)","v":0.3},{"$f":"IF(Rapport!S51=\"\",\"\",Rapport!S51)","v":0.3},{"$f":"IF(Rapport!T51=\"\",\"\",Rapport!T51)","v":950},{"$f":"IF(Rapport!U51=\"\",\"\",Rapport!U51)","v":"gulgrumligt"}]
[22,"32 Fjällfotasjön","2021-06-14","",19.399999999999999,9.9,108,9.06,16,33,"",28,76,"<10","<10",2200,{"$f":"IF(Rapport!Q52=\"\",\"\",Rapport!Q52)","v":38},{"$f":"IF(Rapport!R52=\"\",\"\",Rapport!R52)","v":0.6},{"$f":"IF(Rapport!S52=\"\",\"\",Rapport!S52)","v":0.5},{"$f":"IF(Rapport!T52=\"\",\"\",Rapport!T52)","v":900},{"$f":"IF(Rapport!U52=\"\",\"\",Rapport!U52)","v":"gröngrumligt"}]
[24,"33 Yddingen","2021-06-14","",20.100000000000001,8.3000000000000007,91,8.44,14,48.6,"",22,54,"<10","<10",1900,{"$f":"IF(Rapport!Q53=\"\",\"\",Rapport!Q53)","v":40},{"$f":"IF(Rapport!R53=\"\",\"\",Rapport!R53)","v":0.55000000000000004},{"$f":"IF(Rapport!S53=\"\",\"\",Rapport!S53)","v":0.5},{"$f":"IF(Rapport!T53=\"\",\"\",Rapport!T53)","v":800},{"$f":"IF(Rapport!U53=\"\",\"\",Rapport!U53)","v":"brungrumligt"}]
[26,"34 Havgårdssjön","2021-06-14","",19.100000000000001,8.6999999999999993,94,8.23,4.7,30.6,"",10,56,84,130,1100,{"$f":"IF(Rapport!Q54=\"\",\"\",Rapport!Q54)","v":8},{"$f":"IF(Rapport!R54=\"\",\"\",Rapport!R54)","v":2},{"$f":"IF(Rapport!S54=\"\",\"\",Rapport!S54)","v":1.8},{"$f":"IF(Rapport!T54=\"\",\"\",Rapport!T54)","v":1030},{"$f":"IF(Rapport!U54=\"\",\"\",Rapport!U54)","v":"klart vatten"}]
[30,"A1 Alnarpsån, mynningen","2021-06-15","",16.399999999999999,4.4000000000000004,45,7.69,5.4,98.3,"",6.9,130,2300,41,2800,{"$f":"IF(Rapport!Q55=\"\",\"\",Rapport!Q55)","v":""},{"$f":"IF(Rapport!R55=\"\",\"\",Rapport!R55)","v":""},{"$f":"IF(Rapport!S55=\"\",\"\",Rapport!S55)","v":""},{"$f":"IF(Rapport!T55=\"\",\"\",Rapport!T55)","v":750},{"$f":"IF(Rapport!U55=\"\",\"\",Rapport!U55)","v":""}]
[32,"A4 Alnarpsån, Coyetgården","2021-06-15","",14.3,9.6,94,8.06,2.1,97,"",5.2,97,1200,100,1600,{"$f":"IF(Rapport!Q56=\"\",\"\",Rapport!Q56)","v":""},{"$f":"IF(Rapport!R56=\"\",\"\",Rapport!R56)","v":""},{"$f":"IF(Rapport!S56=\"\",\"\",Rapport!S56)","v":""},{"$f":"IF(Rapport!T56=\"\",\"\",Rapport!T56)","v":730},{"$f":"IF(Rapport!U56=\"\",\"\",Rapport!U56)","v":""}]
[200]
[250,"juli"]
[20,"31 Börringesjön","2021-07-13","",21.6,10.1,114,8.83,30,37.799999999999997,"",22,75,"<10","<10",2200,{"$f":"IF(Rapport!Q59=\"\",\"\",Rapport!Q59)","v":40},{"$f":"IF(Rapport!R59=\"\",\"\",Rapport!R59)","v":0.4},{"$f":"IF(Rapport!S59=\"\",\"\",Rapport!S59)","v":0.4},{"$f":"IF(Rapport!T59=\"\",\"\",Rapport!T59)","v":920},{"$f":"IF(Rapport!U59=\"\",\"\",Rapport!U59)","v":"gulgrumligt"}]
[22,"32 Fjällfotasjön","2021-07-13","",22.1,9.6,110,8.82,13,32.299999999999997,"",29,54,"<10",14,1900,{"$f":"IF(Rapport!Q60=\"\",\"\",Rapport!Q60)","v":25},{"$f":"IF(Rapport!R60=\"\",\"\",Rapport!R60)","v":0.6},{"$f":"IF(Rapport!S60=\"\",\"\",Rapport!S60)","v":0.5},{"$f":"IF(Rapport!T60=\"\",\"\",Rapport!T60)","v":830},{"$f":"IF(Rapport!U60=\"\",\"\",Rapport!U60)","v":"gröngrumligt"}]
[24,"33 Yddingen","2021-07-13","",21.9,9,102,8.6300000000000008,14,49.5,"",21,47,"<10","<10",1700,{"$f":"IF(Rapport!Q61=\"\",\"\",Rapport!Q61)","v":36},{"$f":"IF(Rapport!R61=\"\",\"\",Rapport!R61)","v":0.4},{"$f":"IF(Rapport!S61=\"\",\"\",Rapport!S61)","v":0.4},{"$f":"IF(Rapport!T61=\"\",\"\",Rapport!T61)","v":745},{"$f":"IF(Rapport!U61=\"\",\"\",Rapport!U61)","v":"gulgrumligt"}]
[26,"34 Havgårdssjön","2021-07-13","",22.1,9,103,8.41,3.6,28,"",9.3000000000000007,45,"<10",24,920,{"$f":"IF(Rapport!Q62=\"\",\"\",Rapport!Q62)","v":8.1999999999999993},{"$f":"IF(Rapport!R62=\"\",\"\",Rapport!R62)","v":2.2000000000000002},{"$f":"IF(Rapport!S62=\"\",\"\",Rapport!S62)","v":2},{"$f":"IF(Rapport!T62=\"\",\"\",Rapport!T62)","v":1000},{"$f":"IF(Rapport!U62=\"\",\"\",Rapport!U62)","v":"klart vatten"}]
[200]
[250,"augusti"]
[3,"1  Sege å, vid Brännemölla, uppströms Svedala AR","2021-08-19","",14.5,8.5,84,7.5,14,50.2,5.6,22,120,1100,130,3000,{"$f":"IF(Rapport!Q65=\"\",\"\",Rapport!Q65)","v":""},{"$f":"IF(Rapport!R65=\"\",\"\",Rapport!R65)","v":""},{"$f":"IF(Rapport!S65=\"\",\"\",Rapport!S65)","v":""},{"$f":"IF(Rapport!T65=\"\",\"\",Rapport!T65)","v":1310},{"$f":"IF(Rapport!U65=\"\",\"\",Rapport!U65)","v":""}]
[5,"2  Sege å, söder Krågeholm, nedströms Svedala AR","2021-08-19",0.17,16.5,8.5,87,7.71,7.2,44.9,4,11,120,1300,76,2300,{"$f":"IF(Rapport!Q66=\"\",\"\",Rapport!Q66)","v":""},{"$f":"IF(Rapport!R66=\"\",\"\",Rapport!R66)","v":""},{"$f":"IF(Rapport!S66=\"\",\"\",Rapport!S66)","v":""},{"$f":"IF(Rapport!T66=\"\",\"\",Rapport!T66)","v":1330},{"$f":"IF(Rapport!U66=\"\",\"\",Rapport!U66)","v":""}]
[7,"9  Sege å, vid Lilla Mölleberga","2021-08-19","",15,7,70,7.7,6.3,35.4,"",7.7,120,920,83,1600,{"$f":"IF(Rapport!Q67=\"\",\"\",Rapport!Q67)","v":""},{"$f":"IF(Rapport!R67=\"\",\"\",Rapport!R67)","v":""},{"$f":"IF(Rapport!S67=\"\",\"\",Rapport!S67)","v":""},{"$f":"IF(Rapport!T67=\"\",\"\",Rapport!T67)","v":1220},{"$f":"IF(Rapport!U67=\"\",\"\",Rapport!U67)","v":""}]
[9,"18 Sege å, nordväst Valdemarsro, järnvägsbron","2021-08-19","",15.6,6.6,66,7.63,8.6,45.1,"",7,100,830,35,1200,{"$f":"IF(Rapport!Q68=\"\",\"\",Rapport!Q68)","v":""},{"$f":"IF(Rapport!R68=\"\",\"\",Rapport!R68)","v":""},{"$f":"IF(Rapport!S68=\"\",\"\",Rapport!S68)","v":""},{"$f":"IF(Rapport!T68=\"\",\"\",Rapport!T68)","v":1140},{"$f":"IF(Rapport!U68=\"\",\"\",Rapport!U68)","v":""}]
[11,"21 Spångholmsbäcken, vid utlopp till Sege å","2021-08-19","",15,9.5,94,7.7,4.3,59.2,"",7.8,130,1600,86,2100,{"$f":"IF(Rapport!Q69=\"\",\"\",Rapport!Q69)","v":""},{"$f":"IF(Rapport!R69=\"\",\"\",Rapport!R69)","v":""},{"$f":"IF(Rapport!S69=\"\",\"\",Rapport!S69)","v":""},{"$f":"IF(Rapport!T69=\"\",\"\",Rapport!T69)","v":1230},{"$f":"IF(Rapport!U69=\"\",\"\",Rapport!U69)","v":""}]
[13,"22b Spångholmsbäcken, bron vid Torupsvägen","2021-08-19","",14.4,5.7,56,7.66,3.4,73.5,"",9.6999999999999993,68,4500,40,5200,{"$f":"IF(Rapport!Q70=\"\",\"\",Rapport!Q70)","v":""},{"$f":"IF(Rapport!R70=\"\",\"\",Rapport!R70)","v":""},{"$f":"IF(Rapport!S70=\"\",\"\",Rapport!S70)","v":""},{"$f":"IF(Rapport!T70=\"\",\"\",Rapport!T70)","v":1240},{"$f":"IF(Rapport!U70=\"\",\"\",Rapport!U70)","v":""}]
[15,"23 Spångholmsbäcken, uppströms Torupsdammen","2021-08-19","",15.6,7.1,72,7.77,12,60.9,"",7.1,110,2900,31,3500,{"$f":"IF(Rapport!Q71=\"\",\"\",Rapport!Q71)","v":""},{"$f":"IF(Rapport!R71=\"\",\"\",Rapport!R71)","v":""},{"$f":"IF(Rapport!S71=\"\",\"\",Rapport!S71)","v":""},{"$f":"IF(Rapport!T71=\"\",\"\",Rapport!T71)","v":1250},{"$f":"IF(Rapport!U71=\"\",\"\",Rapport!U71)","v":""}]
[17,"10 Torrebergabäcken, vägbron nordost Mölleberga","2021-08-19","",15.6,3.9,39,7.56,5.6,28.3,"",6.5,140,390,36,890,{"$f":"IF(Rapport!Q72=\"\",\"\",Rapport!Q72)","v":""},{"$f":"IF(Rapport!R72=\"\",\"\",Rapport!R72)","v":""},{"$f":"IF(Rapport!S72=\"\",\"\",Rapport!S72)","v":""},{"$f":"IF(Rapport!T72=\"\",\"\",Rapport!T72)","v":1210},{"$f":"IF(Rapport!U72=\"\",\"\",Rapport!U72)","v":""}]
[18,"15 Risebergabäcken, ca 250 m uppströms från Sege å","2021-08-19","",15.5,5.8,58,7.96,32,63.8,"",7.1,110,2900,31,3500,{"$f":"IF(Rapport!Q73=\"\",\"\",Rapport!Q73)","v":""},{"$f":"IF(Rapport!R73=\"\",\"\",Rapport!R73)","v":""},{"$f":"IF(Rapport!S73=\"\",\"\",Rapport!S73)","v":""},{"$f":"IF(Rapport!T73=\"\",\"\",Rapport!T73)","v":1150},{"$f":"IF(Rapport!U73=\"\",\"\",Rapport!U73)","v":""}]
[20,"31 Börringesjön","2021-08-18","",16.2,10,102,8.48,34,35.4,"",20,74,"<10","<10",2100,{"$f":"IF(Rapport!Q74=\"\",\"\",Rapport!Q74)","v":43},{"$f":"IF(Rapport!R74=\"\",\"\",Rapport!R74)","v":0.3},{"$f":"IF(Rapport!S74=\"\",\"\",Rapport!S74)","v":0.3},{"$f":"IF(Rapport!T74=\"\",\"\",Rapport!T74)","v":1100},{"$f":"IF(Rapport!U74=\"\",\"\",Rapport!U74)","v":"gulgrumligt"}]
[22,"32 Fjällfotasjön","2021-08-18","",16.600000000000001,8.9,92,8.1199999999999992,12,32.4,"",27,70,"<10",11,2000,{"$f":"IF(Rapport!Q75=\"\",\"\",Rapport!Q75)","v":23},{"$f":"IF(Rapport!R75=\"\",\"\",Rapport!R75)","v":0.8},{"$f":"IF(Rapport!S75=\"\",\"\",Rapport!S75)","v":0.7},{"$f":"IF(Rapport!T75=\"\",\"\",Rapport!T75)","v":1000},{"$f":"IF(Rapport!U75=\"\",\"\",Rapport!U75)","v":"ganska klart vatten"}]
[24,"33 Yddingen","2021-08-18","",17,8.8000000000000007,91,8.27,22,50.5,"",20,74,"<10","<10",2100,{"$f":"IF(Rapport!Q76=\"\",\"\",Rapport!Q76)","v":43},{"$f":"IF(Rapport!R76=\"\",\"\",Rapport!R76)","v":0.6},{"$f":"IF(Rapport!S76=\"\",\"\",Rapport!S76)","v":0.6},{"$f":"IF(Rapport!T76=\"\",\"\",Rapport!T76)","v":845},{"$f":"IF(Rapport!U76=\"\",\"\",Rapport!U76)","v":"grumligt"}]
[26,"34 Havgårdssjön","2021-08-18","",18.3,9.9,105,8.4700000000000006,6.2,25.6,"",10,58,48,"<10",1200,{"$f":"IF(Rapport!Q77=\"\",\"\",Rapport!Q77)","v":17},{"$f":"IF(Rapport!R77=\"\",\"\",Rapport!R77)","v":1.5},{"$f":"IF(Rapport!S77=\"\",\"\",Rapport!S77)","v":1.3},{"$f":"IF(Rapport!T77=\"\",\"\",Rapport!T77)","v":1400},{"$f":"IF(Rapport!U77=\"\",\"\",Rapport!U77)","v":"klart vatten"}]
[28,"35 Eksholmssjön","2021-08-18","",18,8.6999999999999993,92,7.14,7,11,"",23,58,"<10",10,1100,{"$f":"IF(Rapport!Q78=\"\",\"\",Rapport!Q78)","v":19},{"$f":"IF(Rapport!R78=\"\",\"\",Rapport!R78)","v":1},{"$f":"IF(Rapport!S78=\"\",\"\",Rapport!S78)","v":0.9},{"$f":"IF(Rapport!T78=\"\",\"\",Rapport!T78)","v":1500},{"$f":"IF(Rapport!U78=\"\",\"\",Rapport!U78)","v":"humöst"}]
[30,"A1 Alnarpsån, mynningen","2021-08-19","",15.7,5.5,56,7.55,5.7,78,"",9.3000000000000007,120,1700,68,1900,{"$f":"IF(Rapport!Q79=\"\",\"\",Rapport!Q79)","v":""},{"$f":"IF(Rapport!R79=\"\",\"\",Rapport!R79)","v":""},{"$f":"IF(Rapport!S79=\"\",\"\",Rapport!S79)","v":""},{"$f":"IF(Rapport!T79=\"\",\"\",Rapport!T79)","v":1120},{"$f":"IF(Rapport!U79=\"\",\"\",Rapport!U79)","v":""}]
[32,"A4 Alnarpsån, Coyetgården","2021-08-19","",13.7,6.1,59,8.1999999999999993,2.2999999999999998,49.5,"",5.6,72,470,17,800,{"$f":"IF(Rapport!Q80=\"\",\"\",Rapport!Q80)","v":""},{"$f":"IF(Rapport!R80=\"\",\"\",Rapport!R80)","v":""},{"$f":"IF(Rapport!S80=\"\",\"\",Rapport!S80)","v":""},{"$f":"IF(Rapport!T80=\"\",\"\",Rapport!T80)","v":1100},{"$f":"IF(Rapport!U80=\"\",\"\",Rapport!U80)","v":""}]
[200]
[250,"september"]
[20,"31 Börringesjön","2021-09-20","",14.1,11,107,8.58,37,37.1,"",26,98,"<10","<10",2900,{"$f":"IF(Rapport!Q83=\"\",\"\",Rapport!Q83)","v":80},{"$f":"IF(Rapport!R83=\"\",\"\",Rapport!R83)","v":0.3},{"$f":"IF(Rapport!S83=\"\",\"\",Rapport!S83)","v":0.3},{"$f":"IF(Rapport!T83=\"\",\"\",Rapport!T83)","v":930},{"$f":"IF(Rapport!U83=\"\",\"\",Rapport!U83)","v":"gulgrumligt"}]
[22,"32 Fjällfotasjön","2021-09-20","",14.6,10.1,100,8.16,8.5,34,"",26,51,"<10",170,2100,{"$f":"IF(Rapport!Q84=\"\",\"\",Rapport!Q84)","v":28},{"$f":"IF(Rapport!R84=\"\",\"\",Rapport!R84)","v":0.7},{"$f":"IF(Rapport!S84=\"\",\"\",Rapport!S84)","v":0.6},{"$f":"IF(Rapport!T84=\"\",\"\",Rapport!T84)","v":845},{"$f":"IF(Rapport!U84=\"\",\"\",Rapport!U84)","v":"gröngrumligt"}]
[24,"33 Yddingen","2021-09-20","",15.2,9.6,96,8.25,17,49.8,"",20,63,"<50","<10",2300,{"$f":"IF(Rapport!Q85=\"\",\"\",Rapport!Q85)","v":82},{"$f":"IF(Rapport!R85=\"\",\"\",Rapport!R85)","v":0.55000000000000004},{"$f":"IF(Rapport!S85=\"\",\"\",Rapport!S85)","v":0.5},{"$f":"IF(Rapport!T85=\"\",\"\",Rapport!T85)","v":800},{"$f":"IF(Rapport!U85=\"\",\"\",Rapport!U85)","v":"brungrumligt"}]
[26,"34 Havgårdssjön","2021-09-20","",16,11,112,8.32,6.5,26.9,"",9.3000000000000007,54,"<10",120,1200,{"$f":"IF(Rapport!Q86=\"\",\"\",Rapport!Q86)","v":26},{"$f":"IF(Rapport!R86=\"\",\"\",Rapport!R86)","v":1.4},{"$f":"IF(Rapport!S86=\"\",\"\",Rapport!S86)","v":1.2},{"$f":"IF(Rapport!T86=\"\",\"\",Rapport!T86)","v":1000},{"$f":"IF(Rapport!U86=\"\",\"\",Rapport!U86)","v":"gröngrumligt"}]
[200]
[250,"oktober"]
[3,"1  Sege å, vid Brännemölla, uppströms Svedala AR","2021-10-20","",11.5,7.5,69,7.62,76,54.5,5.7,21,210,5600,48,7700,{"$f":"IF(Rapport!Q89=\"\",\"\",Rapport!Q89)","v":""},{"$f":"IF(Rapport!R89=\"\",\"\",Rapport!R89)","v":""},{"$f":"IF(Rapport!S89=\"\",\"\",Rapport!S89)","v":""},{"$f":"IF(Rapport!T89=\"\",\"\",Rapport!T89)","v":1400},{"$f":"IF(Rapport!U89=\"\",\"\",Rapport!U89)","v":""}]
[5,"2  Sege å, söder Krågeholm, nedströms Svedala AR","2021-10-20",0.23,12.9,7.9,75,7.61,39,54.1,4.5999999999999996,11,150,2900,160,4400,{"$f":"IF(Rapport!Q90=\"\",\"\",Rapport!Q90)","v":""},{"$f":"IF(Rapport!R90=\"\",\"\",Rapport!R90)","v":""},{"$f":"IF(Rapport!S90=\"\",\"\",Rapport!S90)","v":""},{"$f":"IF(Rapport!T90=\"\",\"\",Rapport!T90)","v":1430},{"$f":"IF(Rapport!U90=\"\",\"\",Rapport!U90)","v":""}]
[7,"9  Sege å, vid Lilla Mölleberga","2021-10-20","",11.9,8.1,75,7.9,5.6,66.2,"",8.3000000000000007,81,2000,18,2900,{"$f":"IF(Rapport!Q91=\"\",\"\",Rapport!Q91)","v":""},{"$f":"IF(Rapport!R91=\"\",\"\",Rapport!R91)","v":""},{"$f":"IF(Rapport!S91=\"\",\"\",Rapport!S91)","v":""},{"$f":"IF(Rapport!T91=\"\",\"\",Rapport!T91)","v":1255},{"$f":"IF(Rapport!U91=\"\",\"\",Rapport!U91)","v":""}]
[9,"18 Sege å, nordväst Valdemarsro, järnvägsbron","2021-10-20","",12,8.3000000000000007,77,7.89,8.6999999999999993,59.6,"",7.9,84,1800,50,2600,{"$f":"IF(Rapport!Q92=\"\",\"\",Rapport!Q92)","v":""},{"$f":"IF(Rapport!R92=\"\",\"\",Rapport!R92)","v":""},{"$f":"IF(Rapport!S92=\"\",\"\",Rapport!S92)","v":""},{"$f":"IF(Rapport!T92=\"\",\"\",Rapport!T92)","v":1200},{"$f":"IF(Rapport!U92=\"\",\"\",Rapport!U92)","v":""}]
[11,"21 Spångholmsbäcken, vid utlopp till Sege å","2021-10-20","",12.4,7.2,68,7.73,4.2,62,"",7.1,66,1500,28,2200,{"$f":"IF(Rapport!Q93=\"\",\"\",Rapport!Q93)","v":""},{"$f":"IF(Rapport!R93=\"\",\"\",Rapport!R93)","v":""},{"$f":"IF(Rapport!S93=\"\",\"\",Rapport!S93)","v":""},{"$f":"IF(Rapport!T93=\"\",\"\",Rapport!T93)","v":1300},{"$f":"IF(Rapport!U93=\"\",\"\",Rapport!U93)","v":""}]
[13,"22b Spångholmsbäcken, bron vid Torupsvägen","2021-10-20","",12.4,7.8,73,7.63,3.9,80.099999999999994,"",13,64,5100,15,6400,{"$f":"IF(Rapport!Q94=\"\",\"\",Rapport!Q94)","v":""},{"$f":"IF(Rapport!R94=\"\",\"\",Rapport!R94)","v":""},{"$f":"IF(Rapport!S94=\"\",\"\",Rapport!S94)","v":""},{"$f":"IF(Rapport!T94=\"\",\"\",Rapport!T94)","v":1315},{"$f":"IF(Rapport!U94=\"\",\"\",Rapport!U94)","v":""}]
[15,"23 Spångholmsbäcken, uppströms Torupsdammen","2021-10-20","",12.8,7.6,72,7.51,1.5,70.099999999999994,"",17,94,360,45,1600,{"$f":"IF(Rapport!Q95=\"\",\"\",Rapport!Q95)","v":""},{"$f":"IF(Rapport!R95=\"\",\"\",Rapport!R95)","v":""},{"$f":"IF(Rapport!S95=\"\",\"\",Rapport!S95)","v":""},{"$f":"IF(Rapport!T95=\"\",\"\",Rapport!T95)","v":1330},{"$f":"IF(Rapport!U95=\"\",\"\",Rapport!U95)","v":""}]
[17,"10 Torrebergabäcken, vägbron nordost Mölleberga","2021-10-20","",11.5,5.7,52,7.65,5.2,71.3,"",13,98,2400,59,3200,{"$f":"IF(Rapport!Q96=\"\",\"\",Rapport!Q96)","v":""},{"$f":"IF(Rapport!R96=\"\",\"\",Rapport!R96)","v":""},{"$f":"IF(Rapport!S96=\"\",\"\",Rapport!S96)","v":""},{"$f":"IF(Rapport!T96=\"\",\"\",Rapport!T96)","v":1245},{"$f":"IF(Rapport!U96=\"\",\"\",Rapport!U96)","v":""}]
[18,"15 Risebergabäcken, ca 250 m uppströms från Sege å","2021-10-20","",13.3,9.5,91,7.88,16,40.9,"",4.5,91,1500,100,1700,{"$f":"IF(Rapport!Q97=\"\",\"\",Rapport!Q97)","v":""},{"$f":"IF(Rapport!R97=\"\",\"\",Rapport!R97)","v":""},{"$f":"IF(Rapport!S97=\"\",\"\",Rapport!S97)","v":""},{"$f":"IF(Rapport!T97=\"\",\"\",Rapport!T97)","v":1215},{"$f":"IF(Rapport!U97=\"\",\"\",Rapport!U97)","v":""}]
[30,"A1 Alnarpsån, mynningen","2021-10-20","",12.6,7.2,68,7.7,20,50.3,"",3.8,110,740,44,1000,{"$f":"IF(Rapport!Q98=\"\",\"\",Rapport!Q98)","v":""},{"$f":"IF(Rapport!R98=\"\",\"\",Rapport!R98)","v":""},{"$f":"IF(Rapport!S98=\"\",\"\",Rapport!S98)","v":""},{"$f":"IF(Rapport!T98=\"\",\"\",Rapport!T98)","v":1145},{"$f":"IF(Rapport!U98=\"\",\"\",Rapport!U98)","v":""}]
[32,"A4 Alnarpsån, Coyetgården","2021-10-20","",13.2,9.1,87,7.75,6,49.1,"",5.2,110,1000,25,1500,{"$f":"IF(Rapport!Q99=\"\",\"\",Rapport!Q99)","v":""},{"$f":"IF(Rapport!R99=\"\",\"\",Rapport!R99)","v":""},{"$f":"IF(Rapport!S99=\"\",\"\",Rapport!S99)","v":""},{"$f":"IF(Rapport!T99=\"\",\"\",Rapport!T99)","v":1130},{"$f":"IF(Rapport!U99=\"\",\"\",Rapport!U99)","v":""}]
[200]
[250,"december"]
[3,"1  Sege å, vid Brännemölla, uppströms Svedala AR","2021-12-20","",1.3,10.5,74,7.58,20,45.8,5.8,24,120,1900,650,4400,{"$f":"IF(Rapport!Q102=\"\",\"\",Rapport!Q102)","v":""},{"$f":"IF(Rapport!R102=\"\",\"\",Rapport!R102)","v":""},{"$f":"IF(Rapport!S102=\"\",\"\",Rapport!S102)","v":""},{"$f":"IF(Rapport!T102=\"\",\"\",Rapport!T102)","v":1430},{"$f":"IF(Rapport!U102=\"\",\"\",Rapport!U102)","v":""}]
[5,"2  Sege å, söder Krågeholm, nedströms Svedala AR","2021-12-20",1.1000000000000001,2.7,11.5,85,7.66,19,52.2,6.6,17,170,2700,580,4800,{"$f":"IF(Rapport!Q103=\"\",\"\",Rapport!Q103)","v":""},{"$f":"IF(Rapport!R103=\"\",\"\",Rapport!R103)","v":""},{"$f":"IF(Rapport!S103=\"\",\"\",Rapport!S103)","v":""},{"$f":"IF(Rapport!T103=\"\",\"\",Rapport!T103)","v":1445},{"$f":"IF(Rapport!U103=\"\",\"\",Rapport!U103)","v":""}]
[7,"9  Sege å, vid Lilla Mölleberga","2021-12-20","",2.9,12.2,90,7.97,12,61.3,"",16,93,3600,310,4200,{"$f":"IF(Rapport!Q104=\"\",\"\",Rapport!Q104)","v":""},{"$f":"IF(Rapport!R104=\"\",\"\",Rapport!R104)","v":""},{"$f":"IF(Rapport!S104=\"\",\"\",Rapport!S104)","v":""},{"$f":"IF(Rapport!T104=\"\",\"\",Rapport!T104)","v":1330},{"$f":"IF(Rapport!U104=\"\",\"\",Rapport!U104)","v":""}]
[9,"18 Sege å, nordväst Valdemarsro, järnvägsbron","2021-12-20","",3.4,11.5,86,7.98,11,69.400000000000006,"",14,90,5200,170,5600,{"$f":"IF(Rapport!Q105=\"\",\"\",Rapport!Q105)","v":""},{"$f":"IF(Rapport!R105=\"\",\"\",Rapport!R105)","v":""},{"$f":"IF(Rapport!S105=\"\",\"\",Rapport!S105)","v":""},{"$f":"IF(Rapport!T105=\"\",\"\",Rapport!T105)","v":1300},{"$f":"IF(Rapport!U105=\"\",\"\",Rapport!U105)","v":""}]
[11,"21 Spångholmsbäcken, vid utlopp till Sege å","2021-12-20","",2.4,12.1,88,7.94,7.9,58.3,"",16,66,1400,390,2600,{"$f":"IF(Rapport!Q106=\"\",\"\",Rapport!Q106)","v":""},{"$f":"IF(Rapport!R106=\"\",\"\",Rapport!R106)","v":""},{"$f":"IF(Rapport!S106=\"\",\"\",Rapport!S106)","v":""},{"$f":"IF(Rapport!T106=\"\",\"\",Rapport!T106)","v":1345},{"$f":"IF(Rapport!U106=\"\",\"\",Rapport!U106)","v":""}]
[13,"22b Spångholmsbäcken, bron vid Torupsvägen","2021-12-20","",2,12.5,90,7.94,6.3,54.5,"",17,64,920,520,3000,{"$f":"IF(Rapport!Q107=\"\",\"\",Rapport!Q107)","v":""},{"$f":"IF(Rapport!R107=\"\",\"\",Rapport!R107)","v":""},{"$f":"IF(Rapport!S107=\"\",\"\",Rapport!S107)","v":""},{"$f":"IF(Rapport!T107=\"\",\"\",Rapport!T107)","v":1355},{"$f":"IF(Rapport!U107=\"\",\"\",Rapport!U107)","v":""}]
[15,"23 Spångholmsbäcken, uppströms Torupsdammen","2021-12-20","",1.9,12.2,88,8.19,7.3,52.2,"",19,66,310,540,2000,{"$f":"IF(Rapport!Q108=\"\",\"\",Rapport!Q108)","v":""},{"$f":"IF(Rapport!R108=\"\",\"\",Rapport!R108)","v":""},{"$f":"IF(Rapport!S108=\"\",\"\",Rapport!S108)","v":""},{"$f":"IF(Rapport!T108=\"\",\"\",Rapport!T108)","v":1410},{"$f":"IF(Rapport!U108=\"\",\"\",Rapport!U108)","v":""}]
[17,"10 Torrebergabäcken, vägbron nordost Mölleberga","2021-12-20","",2.6,10,74,7.81,7,70.8,"",16,85,7700,160,7300,{"$f":"IF(Rapport!Q109=\"\",\"\",Rapport!Q109)","v":""},{"$f":"IF(Rapport!R109=\"\",\"\",Rapport!R109)","v":""},{"$f":"IF(Rapport!S109=\"\",\"\",Rapport!S109)","v":""},{"$f":"IF(Rapport!T109=\"\",\"\",Rapport!T109)","v":1315},{"$f":"IF(Rapport!U109=\"\",\"\",Rapport!U109)","v":""}]
[18,"15 Risebergabäcken, ca 250 m uppströms från Sege å","2021-12-20","",7,11.1,92,8.14,4.5,110,"",5.7,56,4900,120,5000,{"$f":"IF(Rapport!Q110=\"\",\"\",Rapport!Q110)","v":""},{"$f":"IF(Rapport!R110=\"\",\"\",Rapport!R110)","v":""},{"$f":"IF(Rapport!S110=\"\",\"\",Rapport!S110)","v":""},{"$f":"IF(Rapport!T110=\"\",\"\",Rapport!T110)","v":1305},{"$f":"IF(Rapport!U110=\"\",\"\",Rapport!U110)","v":""}]
[30,"A1 Alnarpsån, mynningen","2021-12-20","",4.4000000000000004,10.7,83,7.99,3.4,102,"",5.8,74,12000,55,12000,{"$f":"IF(Rapport!Q111=\"\",\"\",Rapport!Q111)","v":""},{"$f":"IF(Rapport!R111=\"\",\"\",Rapport!R111)","v":""},{"$f":"IF(Rapport!S111=\"\",\"\",Rapport!S111)","v":""},{"$f":"IF(Rapport!T111=\"\",\"\",Rapport!T111)","v":1245},{"$f":"IF(Rapport!U111=\"\",\"\",Rapport!U111)","v":""}]
[32,"A4 Alnarpsån, Coyetgården","2021-12-20","",5.3,12.2,96,8.17,2.2000000000000002,88.1,"",3.4,90,11000,19,11000,{"$f":"IF(Rapport!Q112=\"\",\"\",Rapport!Q112)","v":""},{"$f":"IF(Rapport!R112=\"\",\"\",Rapport!R112)","v":""},{"$f":"IF(Rapport!S112=\"\",\"\",Rapport!S112)","v":""},{"$f":"IF(Rapport!T112=\"\",\"\",Rapport!T112)","v":1230},{"$f":"IF(Rapport!U112=\"\",\"\",Rapport!U112)","v":""}]
[200]

{"sheet":"RS","index":2,"n_rows":170,"n_cols":23,"rows_kept":170,"cut":false,"hidden":true,"merged":[]}
[{"$f":"TRIM(CONCATENATE(D1,E1))","v":"ProvtagningspunktProvtagn"},null,"Sorterings-","Provtagningspunkt","Provtagn"," Vattenf"," Temp"," Syreh","Syrem","  pH","Gruml","  Kond","BOD7","TOC","Tot-P"," NO3+2-N","NH4-N"," Tot-N","Klor a","Siktdj VK","Siktdj","   Tid","Anmärkning"]
[null,null,"ordning","Nr Läge","datum","    m3/s","  °C","mg/l","%",null,"  FNU","mS/m","mg/l","mg/l"," µg/l","  µg/l","  µg/l","  µg/l","mg/m3","m","m"]
[{"$f":"TRIM(CONCATENATE(D3,E3))","v":"1 Sege å, vid Brännemölla, uppströms Svedala AR44242"},{"$f":"CONCATENATE(D3,MONTH(E3))","v":"1  Sege å, vid Brännemölla, uppströms Svedala AR2"},3,"1  Sege å, vid Brännemölla, uppströms Svedala AR","2021-02-15","",0.4,14,97,7.78,12,50.4,4.9000000000000004,22,65,1800,250,3600,"","","",1545,"is i kanten "]
["1 Sege å, vid Brännemölla, uppströms Svedala AR44305","1  Sege å, vid Brännemölla, uppströms Svedala AR4",3,"1  Sege å, vid Brännemölla, uppströms Svedala AR","2021-04-19","",9.8000000000000007,11.2,99,7.81,11,47.7,6.3,22,66,1300,"<10",2900,"","","",1050,"grumligt "]
["1 Sege å, vid Brännemölla, uppströms Svedala AR44362","1  Sege å, vid Brännemölla, uppströms Svedala AR6",3,"1  Sege å, vid Brännemölla, uppströms Svedala AR","2021-06-15","",16.399999999999999,4.3,44,7.41,18,45.3,7.7,26,160,590,250,3300,"","","",1000,"grumligt"]
["1 Sege å, vid Brännemölla, uppströms Svedala AR44427","1  Sege å, vid Brännemölla, uppströms Svedala AR8",3,"1  Sege å, vid Brännemölla, uppströms Svedala AR","2021-08-19","",14.5,8.5,84,7.5,14,50.2,5.6,22,120,1100,130,3000,"","","",1310,""]
["1 Sege å, vid Brännemölla, uppströms Svedala AR44489","1  Sege å, vid Brännemölla, uppströms Svedala AR10",3,"1  Sege å, vid Brännemölla, uppströms Svedala AR","2021-10-20","",11.5,7.5,69,7.62,76,54.5,5.7,21,210,5600,48,7700,"","","",1400,""]
["1 Sege å, vid Brännemölla, uppströms Svedala AR44550","1  Sege å, vid Brännemölla, uppströms Svedala AR12",3,"1  Sege å, vid Brännemölla, uppströms Svedala AR","2021-12-20","",1.3,10.5,74,7.58,20,45.8,5.8,24,120,1900,650,4400,"","","",1430,""]
["2 Sege å, söder Krågeholm, nedströms Svedala AR44242","2  Sege å, söder Krågeholm, nedströms Svedala AR2",5,"2  Sege å, söder Krågeholm, nedströms Svedala AR","2021-02-15",0.49,1.2,13.5,95,7.8,15,54.2,5,19,86,2900,300,4100,"","","",1600,"is i kanten "]
["2 Sege å, söder Krågeholm, nedströms Svedala AR44305","2  Sege å, söder Krågeholm, nedströms Svedala AR4",5,"2  Sege å, söder Krågeholm, nedströms Svedala AR","2021-04-19",0.41,9.5,12,105,7.89,11,56.8,6.1,18,69,2100,68,3400,"","","",1030,"grumligt "]
["2 Sege å, söder Krågeholm, nedströms Svedala AR44362","2  Sege å, söder Krågeholm, nedströms Svedala AR6",5,"2  Sege å, söder Krågeholm, nedströms Svedala AR","2021-06-15",0.06,16.399999999999999,8,82,7.76,15,63.8,7.6,16,150,1100,700,3400,"","","",1020,"grumligt"]
["2 Sege å, söder Krågeholm, nedströms Svedala AR44427","2  Sege å, söder Krågeholm, nedströms Svedala AR8",5,"2  Sege å, söder Krågeholm, nedströms Svedala AR","2021-08-19",0.17,16.5,8.5,87,7.71,7.2,44.9,4,11,120,1300,76,2300,"","","",1330,""]
["2 Sege å, söder Krågeholm, nedströms Svedala AR44489",{"$f":"CONCATENATE(D13,MONTH(E13))","v":"2  Sege å, söder Krågeholm, nedströms Svedala AR10"},5,"2  Sege å, söder Krågeholm, nedströms Svedala AR","2021-10-20",0.23,12.9,7.9,75,7.61,39,54.1,4.5999999999999996,11,150,2900,160,4400,"","","",1430,""]
["2 Sege å, söder Krågeholm, nedströms Svedala AR44550","2  Sege å, söder Krågeholm, nedströms Svedala AR12",5,"2  Sege å, söder Krågeholm, nedströms Svedala AR","2021-12-20",1.1000000000000001,2.7,11.5,85,7.66,19,52.2,6.6,17,170,2700,580,4800,"","","",1445,""]
["9 Sege å, vid Lilla Mölleberga44242","9  Sege å, vid Lilla Mölleberga2",7,"9  Sege å, vid Lilla Mölleberga","2021-02-15","",0,14,96,7.92,11,68.3,"",16,83,3300,300,3900,"","","",1445,"istäckt"]
["9 Sege å, vid Lilla Mölleberga44305","9  Sege å, vid Lilla Mölleberga4",7,"9  Sege å, vid Lilla Mölleberga","2021-04-19","",9.5,11,97,8,8.1999999999999993,63.8,"",15,77,2100,"<10",2900,"","","",920,""]
["9 Sege å, vid Lilla Mölleberga44362","9  Sege å, vid Lilla Mölleberga6",7,"9  Sege å, vid Lilla Mölleberga","2021-06-15","",16.600000000000001,7.6,78,7.81,8.8000000000000007,65.599999999999994,"",13,120,1100,39,2100,"","","",845,""]
["9 Sege å, vid Lilla Mölleberga44427","9  Sege å, vid Lilla Mölleberga8",7,"9  Sege å, vid Lilla Mölleberga","2021-08-19","",15,7,70,7.7,6.3,35.4,"",7.7,120,920,83,1600,"","","",1220,""]
["9 Sege å, vid Lilla Mölleberga44489","9  Sege å, vid Lilla Mölleberga10",7,"9  Sege å, vid Lilla Mölleberga","2021-10-20","",11.9,8.1,75,7.9,5.6,66.2,"",8.3000000000000007,81,2000,18,2900,"","","",1255,""]
["9 Sege å, vid Lilla Mölleberga44550","9  Sege å, vid Lilla Mölleberga12",7,"9  Sege å, vid Lilla Mölleberga","2021-12-20","",2.9,12.2,90,7.97,12,61.3,"",16,93,3600,310,4200,"","","",1330,""]
["18 Sege å, nordväst Valdemarsro, järnvägsbron44242","18 Sege å, nordväst Valdemarsro, järnvägsbron2",9,"18 Sege å, nordväst Valdemarsro, järnvägsbron","2021-02-15","",0.1,13.5,92,7.89,14,78.2,"",14,99,4300,240,4800,"","","",1400,"is i kanten "]
["18 Sege å, nordväst Valdemarsro, järnvägsbron44305","18 Sege å, nordväst Valdemarsro, järnvägsbron4",9,"18 Sege å, nordväst Valdemarsro, järnvägsbron","2021-04-19","",9.5,10.4,91,8,6.7,70.099999999999994,"",13,62,2400,14,3200,"","","",840,""]
["18 Sege å, nordväst Valdemarsro, järnvägsbron44362","18 Sege å, nordväst Valdemarsro, järnvägsbron6",9,"18 Sege å, nordväst Valdemarsro, järnvägsbron","2021-06-15","",17.2,5.7,59,7.78,4.0999999999999996,73.5,"",12,94,850,87,1700,"","","",810,""]
["18 Sege å, nordväst Valdemarsro, järnvägsbron44427","18 Sege å, nordväst Valdemarsro, järnvägsbron8",9,"18 Sege å, nordväst Valdemarsro, järnvägsbron","2021-08-19","",15.6,6.6,66,7.63,8.6,45.1,"",7,100,830,35,1200,"","","",1140,""]
["18 Sege å, nordväst Valdemarsro, järnvägsbron44489","18 Sege å, nordväst Valdemarsro, järnvägsbron10",9,"18 Sege å, nordväst Valdemarsro, järnvägsbron","2021-10-20","",12,8.3000000000000007,77,7.89,8.6999999999999993,59.6,"",7.9,84,1800,50,2600,"","","",1200,""]
["18 Sege å, nordväst Valdemarsro, järnvägsbron44550","18 Sege å, nordväst Valdemarsro, järnvägsbron12",9,"18 Sege å, nordväst Valdemarsro, järnvägsbron","2021-12-20","",3.4,11.5,86,7.98,11,69.400000000000006,"",14,90,5200,170,5600,"","","",1300,""]
["21 Spångholmsbäcken, vid utlopp till Sege å44242","21 Spångholmsbäcken, vid utlopp till Sege å2",11,"21 Spångholmsbäcken, vid utlopp till Sege å","2021-02-15","",0,13.5,92,7.9,11,68.7,"",16,72,1500,640,3100,"","","",1500,"istäckt"]
["21 Spångholmsbäcken, vid utlopp till Sege å44305","21 Spångholmsbäcken, vid utlopp till Sege å4",11,"21 Spångholmsbäcken, vid utlopp till Sege å","2021-04-19","",8.6,11,95,7.85,7,63.9,"",15,60,1200,50,2100,"","","",930,""]
["21 Spångholmsbäcken, vid utlopp till Sege å44362","21 Spångholmsbäcken, vid utlopp till Sege å6",11,"21 Spångholmsbäcken, vid utlopp till Sege å","2021-06-15","",14.6,6.2,61,7.7,7.7,77.5,"",8.6,120,1000,91,1700,"","","",900,""]
["21 Spångholmsbäcken, vid utlopp till Sege å44427","21 Spångholmsbäcken, vid utlopp till Sege å8",11,"21 Spångholmsbäcken, vid utlopp till Sege å","2021-08-19","",15,9.5,94,7.7,4.3,59.2,"",7.8,130,1600,86,2100,"","","",1230,""]
["21 Spångholmsbäcken, vid utlopp till Sege å44489","21 Spångholmsbäcken, vid utlopp till Sege å10",11,"21 Spångholmsbäcken, vid utlopp till Sege å","2021-10-20","",12.4,7.2,68,7.73,4.2,62,"",7.1,66,1500,28,2200,"","","",1300,""]
["21 Spångholmsbäcken, vid utlopp till Sege å44550","21 Spångholmsbäcken, vid utlopp till Sege å12",11,"21 Spångholmsbäcken, vid utlopp till Sege å","2021-12-20","",2.4,12.1,88,7.94,7.9,58.3,"",16,66,1400,390,2600,"","","",1345,""]
["22b Spångholmsbäcken, bron vid Torupsvägen44242","22b Spångholmsbäcken, bron vid Torupsvägen2",13,"22b Spångholmsbäcken, bron vid Torupsvägen","2021-02-15","",0.1,13.8,95,7.91,6.6,62.9,"",18,55,1400,910,3000,"","","",1510,"is i kanten "]
["22b Spångholmsbäcken, bron vid Torupsvägen44305","22b Spångholmsbäcken, bron vid Torupsvägen4",13,"22b Spångholmsbäcken, bron vid Torupsvägen","2021-04-19","",9.1,11.5,100,7.83,4.3,58.8,"",18,52,1200,180,2300,"","","",950,""]
[{"$f":"TRIM(CONCATENATE(D35,E35))","v":"22b Spångholmsbäcken, bron vid Torupsvägen44362"},"22b Spångholmsbäcken, bron vid Torupsvägen6",13,"22b Spångholmsbäcken, bron vid Torupsvägen","2021-06-15","",14.5,5.4,53,7.68,5.8,74.8,"",11,76,1900,130,4100,"","","",920,""]
["22b Spångholmsbäcken, bron vid Torupsvägen44427","22b Spångholmsbäcken, bron vid Torupsvägen8",13,"22b Spångholmsbäcken, bron vid Torupsvägen","2021-08-19","",14.4,5.7,56,7.66,3.4,73.5,"",9.6999999999999993,68,4500,40,5200,"","","",1240,""]
["22b Spångholmsbäcken, bron vid Torupsvägen44489","22b Spångholmsbäcken, bron vid Torupsvägen10",13,"22b Spångholmsbäcken, bron vid Torupsvägen","2021-10-20","",12.4,7.8,73,7.63,3.9,80.099999999999994,"",13,64,5100,15,6400,"","","",1315,""]
["22b Spångholmsbäcken, bron vid Torupsvägen44550","22b Spångholmsbäcken, bron vid Torupsvägen12",13,"22b Spångholmsbäcken, bron vid Torupsvägen","2021-12-20","",2,12.5,90,7.94,6.3,54.5,"",17,64,920,520,3000,"","","",1355,""]
["23 Spångholmsbäcken, uppströms Torupsdammen44242","23 Spångholmsbäcken, uppströms Torupsdammen2",15,"23 Spångholmsbäcken, uppströms Torupsdammen","2021-02-15","",0,14.3,98,8.01,10,59,"",18,62,760,980,3000,"","","",1520,"istäckt"]
["23 Spångholmsbäcken, uppströms Torupsdammen44305","23 Spångholmsbäcken, uppströms Torupsdammen4",15,"23 Spångholmsbäcken, uppströms Torupsdammen","2021-04-19","",9.4,11.1,97,7.99,3.1,56.4,"",18,53,590,410,2100,"","","",1010,""]
["23 Spångholmsbäcken, uppströms Torupsdammen44362","23 Spångholmsbäcken, uppströms Torupsdammen6",15,"23 Spångholmsbäcken, uppströms Torupsdammen","2021-06-15","",14.6,3.9,38,7.58,5.3,65,"",15,220,45,570,1700,"","","",940,""]
["23 Spångholmsbäcken, uppströms Torupsdammen44427","23 Spångholmsbäcken, uppströms Torupsdammen8",15,"23 Spångholmsbäcken, uppströms Torupsdammen","2021-08-19","",15.6,7.1,72,7.77,12,60.9,"",7.1,110,2900,31,3500,"","","",1250,""]
["23 Spångholmsbäcken, uppströms Torupsdammen44489","23 Spångholmsbäcken, uppströms Torupsdammen10",15,"23 Spångholmsbäcken, uppströms Torupsdammen","2021-10-20","",12.8,7.6,72,7.51,1.5,70.099999999999994,"",17,94,360,45,1600,"","","",1330,""]
["23 Spångholmsbäcken, uppströms Torupsdammen44550","23 Spångholmsbäcken, uppströms Torupsdammen12",15,"23 Spångholmsbäcken, uppströms Torupsdammen","2021-12-20","",1.9,12.2,88,8.19,7.3,52.2,"",19,66,310,540,2000,"","","",1410,""]
["10 Torrebergabäcken, vägbron nordost Mölleberga44242","10 Torrebergabäcken, vägbron nordost Mölleberga2",17,"10 Torrebergabäcken, vägbron nordost Mölleberga","2021-02-15","",0,11.5,79,7.67,9.6,78.900000000000006,"",12,140,6900,210,6700,"","","",1430,"istäckt"]
["10 Torrebergabäcken, vägbron nordost Mölleberga44305","10 Torrebergabäcken, vägbron nordost Mölleberga4",17,"10 Torrebergabäcken, vägbron nordost Mölleberga","2021-04-19","",8.9,9.8000000000000007,85,7.84,5.3,66,"",14,66,2900,20,3600,"","","",910,""]
["10 Torrebergabäcken, vägbron nordost Mölleberga44362","10 Torrebergabäcken, vägbron nordost Mölleberga6",17,"10 Torrebergabäcken, vägbron nordost Mölleberga","2021-06-15","",17.100000000000001,3.4,35,7.52,11,64.8,"",12,150,750,100,1700,"","","",830,""]
["10 Torrebergabäcken, vägbron nordost Mölleberga44427","10 Torrebergabäcken, vägbron nordost Mölleberga8",17,"10 Torrebergabäcken, vägbron nordost Mölleberga","2021-08-19","",15.6,3.9,39,7.56,5.6,28.3,"",6.5,140,390,36,890,"","","",1210,""]
["10 Torrebergabäcken, vägbron nordost Mölleberga44489","10 Torrebergabäcken, vägbron nordost Mölleberga10",17,"10 Torrebergabäcken, vägbron nordost Mölleberga","2021-10-20","",11.5,5.7,52,7.65,5.2,71.3,"",13,98,2400,59,3200,"","","",1245,""]
["10 Torrebergabäcken, vägbron nordost Mölleberga44550","10 Torrebergabäcken, vägbron nordost Mölleberga12",17,"10 Torrebergabäcken, vägbron nordost Mölleberga","2021-12-20","",2.6,10,74,7.81,7,70.8,"",16,85,7700,160,7300,"","","",1315,""]
["15 Risebergabäcken, ca 250 m uppströms från Sege å44242","15 Risebergabäcken, ca 250 m uppströms från Sege å2",18,"15 Risebergabäcken, ca 250 m uppströms från Sege å","2021-02-15","",0.9,14.5,102,8.24,2.6,115,"",5.2,31,1600,37,3600,"","","",1410,""]
["15 Risebergabäcken, ca 250 m uppströms från Sege å44305","15 Risebergabäcken, ca 250 m uppströms från Sege å4",18,"15 Risebergabäcken, ca 250 m uppströms från Sege å","2021-04-19","",9.5,12.2,107,8.06,3.2,104,"",5.5,32,2000,37,2300,"","","",850,""]
["15 Risebergabäcken, ca 250 m uppströms från Sege å44362","15 Risebergabäcken, ca 250 m uppströms från Sege å6",18,"15 Risebergabäcken, ca 250 m uppströms från Sege å","2021-06-15","",13.8,8.5,82,8,5.5,111,"",4.0999999999999996,63,1100,140,1600,"","","",820,""]
["15 Risebergabäcken, ca 250 m uppströms från Sege å44427","15 Risebergabäcken, ca 250 m uppströms från Sege å8",18,"15 Risebergabäcken, ca 250 m uppströms från Sege å","2021-08-19","",15.5,5.8,58,7.96,32,63.8,"",7.1,110,2900,31,3500,"","","",1150,""]
["15 Risebergabäcken, ca 250 m uppströms från Sege å44489","15 Risebergabäcken, ca 250 m uppströms från Sege å10",18,"15 Risebergabäcken, ca 250 m uppströms från Sege å","2021-10-20","",13.3,9.5,91,7.88,16,40.9,"",4.5,91,1500,100,1700,"","","",1215,""]
["15 Risebergabäcken, ca 250 m uppströms från Sege å44550","15 Risebergabäcken, ca 250 m uppströms från Sege å12",18,"15 Risebergabäcken, ca 250 m uppströms från Sege å","2021-12-20","",7,11.1,92,8.14,4.5,110,"",5.7,56,4900,120,5000,"","","",1305,""]
["31 Börringesjön44333","31 Börringesjön5",20,"31 Börringesjön","2021-05-17","",16.3,13.3,136,8.82,36,38.6,"",20,77,"<10","<10",2300,62,0.3,0.3,1000,"gröngrumligt"]
["31 Börringesjön44361","31 Börringesjön6",20,"31 Börringesjön","2021-06-14","",19.2,9.6999999999999993,105,8.67,42,39.299999999999997,"",26,96,"<10","<10",2800,54,0.3,0.3,950,"gulgrumligt"]
["31 Börringesjön44390","31 Börringesjön7",20,"31 Börringesjön","2021-07-13","",21.6,10.1,114,8.83,30,37.799999999999997,"",22,75,"<10","<10",2200,40,0.4,0.4,920,"gulgrumligt"]
["31 Börringesjön44426","31 Börringesjön8",20,"31 Börringesjön","2021-08-18","",16.2,10,102,8.48,34,35.4,"",20,74,"<10","<10",2100,43,0.3,0.3,1100,"gulgrumligt"]
["31 Börringesjön44459","31 Börringesjön9",20,"31 Börringesjön","2021-09-20","",14.1,11,107,8.58,37,37.1,"",26,98,"<10","<10",2900,80,0.3,0.3,930,"gulgrumligt"]
["32 Fjällfotasjön44333","32 Fjällfotasjön5",22,"32 Fjällfotasjön","2021-05-17","",16.399999999999999,10.6,109,8.8699999999999992,8.9,31.4,"",25,52,"<10","<10",1900,28,0.6,0.6,930,"brungrumligt"]
["32 Fjällfotasjön44361","32 Fjällfotasjön6",22,"32 Fjällfotasjön","2021-06-14","",19.399999999999999,9.9,108,9.06,16,33,"",28,76,"<10","<10",2200,38,0.6,0.5,900,"gröngrumligt"]
["32 Fjällfotasjön44390","32 Fjällfotasjön7",22,"32 Fjällfotasjön","2021-07-13","",22.1,9.6,110,8.82,13,32.299999999999997,"",29,54,"<10",14,1900,25,0.6,0.5,830,"gröngrumligt"]
["32 Fjällfotasjön44426","32 Fjällfotasjön8",22,"32 Fjällfotasjön","2021-08-18","",16.600000000000001,8.9,92,8.1199999999999992,12,32.4,"",27,70,"<10",11,2000,23,0.8,0.7,1000,"ganska klart vatten"]
["32 Fjällfotasjön44459","32 Fjällfotasjön9",22,"32 Fjällfotasjön","2021-09-20","",14.6,10.1,100,8.16,8.5,34,"",26,51,"<10",170,2100,28,0.7,0.6,845,"gröngrumligt"]
[{"$f":"TRIM(CONCATENATE(D67,E67))","v":"33 Yddingen44333"},"33 Yddingen5",24,"33 Yddingen","2021-05-17","",16.100000000000001,13.4,136,8.75,14,49.5,"",21,40,"<10","<10",2000,90,0.55000000000000004,0.5,800,"gulgrumligt"]
["33 Yddingen44361","33 Yddingen6",24,"33 Yddingen","2021-06-14","",20.100000000000001,8.3000000000000007,91,8.44,14,48.6,"",22,54,"<10","<10",1900,40,0.55000000000000004,0.5,800,"brungrumligt"]
["33 Yddingen44390","33 Yddingen7",24,"33 Yddingen","2021-07-13","",21.9,9,102,8.6300000000000008,14,49.5,"",21,47,"<10","<10",1700,36,0.4,0.4,745,"gulgrumligt"]
["33 Yddingen44426","33 Yddingen8",24,"33 Yddingen","2021-08-18","",17,8.8000000000000007,91,8.27,22,50.5,"",20,74,"<10","<10",2100,43,0.6,0.6,845,"grumligt"]
["33 Yddingen44459","33 Yddingen9",24,"33 Yddingen","2021-09-20","",15.2,9.6,96,8.25,17,49.8,"",20,63,"<50","<10",2300,82,0.55000000000000004,0.5,800,"brungrumligt"]
["34 Havgårdssjön44333","34 Havgårdssjön5",26,"34 Havgårdssjön","2021-05-17","",16.100000000000001,9.3000000000000007,95,8.31,3.7,30.8,"",7.6,42,180,39,1000,4.2,2,1.8,1030,"ganska klart vatten"]
["34 Havgårdssjön44361","34 Havgårdssjön6",26,"34 Havgårdssjön","2021-06-14","",19.100000000000001,8.6999999999999993,94,8.23,4.7,30.6,"",10,56,84,130,1100,8,2,1.8,1030,"klart vatten"]
["34 Havgårdssjön44390","34 Havgårdssjön7",26,"34 Havgårdssjön","2021-07-13","",22.1,9,103,8.41,3.6,28,"",9.3000000000000007,45,"<10",24,920,8.1999999999999993,2.2000000000000002,2,1000,"klart vatten"]
["34 Havgårdssjön44426","34 Havgårdssjön8",26,"34 Havgårdssjön","2021-08-18","",18.3,9.9,105,8.4700000000000006,6.2,25.6,"",10,58,48,"<10",1200,17,1.5,1.3,1400,"klart vatten"]
["34 Havgårdssjön44459","34 Havgårdssjön9",26,"34 Havgårdssjön","2021-09-20","",16,11,112,8.32,6.5,26.9,"",9.3000000000000007,54,"<10",120,1200,26,1.4,1.2,1000,"gröngrumligt"]
["35 Eksholmssjön44426",{"$f":"CONCATENATE(D77,MONTH(E77))","v":"35 Eksholmssjön8"},28,"35 Eksholmssjön","2021-08-18","",18,8.6999999999999993,92,7.14,7,11,"",23,58,"<10",10,1100,19,1,0.9,1500,"humöst"]
["A1 Alnarpsån, mynningen44242","A1 Alnarpsån, mynningen2",30,"A1 Alnarpsån, mynningen","2021-02-15","",0.1,13.3,91,7.92,18,113,"",5.6,63,5700,160,5800,"","","",1315,"istäckt"]
["A1 Alnarpsån, mynningen44305","A1 Alnarpsån, mynningen4",30,"A1 Alnarpsån, mynningen","2021-04-19","",6.6,18.5,151,7.73,5.4,100,"",6,52,3400,26,3900,"","","",800,""]
["A1 Alnarpsån, mynningen44362","A1 Alnarpsån, mynningen6",30,"A1 Alnarpsån, mynningen","2021-06-15","",16.399999999999999,4.4000000000000004,45,7.69,5.4,98.3,"",6.9,130,2300,41,2800,"","","",750,""]
["A1 Alnarpsån, mynningen44427","A1 Alnarpsån, mynningen8",30,"A1 Alnarpsån, mynningen","2021-08-19","",15.7,5.5,56,7.55,5.7,78,"",9.3000000000000007,120,1700,68,1900,"","","",1120,""]
["A1 Alnarpsån, mynningen44489","A1 Alnarpsån, mynningen10",30,"A1 Alnarpsån, mynningen","2021-10-20","",12.6,7.2,68,7.7,20,50.3,"",3.8,110,740,44,1000,"","","",1145,""]
["A1 Alnarpsån, mynningen44550","A1 Alnarpsån, mynningen12",30,"A1 Alnarpsån, mynningen","2021-12-20","",4.4000000000000004,10.7,83,7.99,3.4,102,"",5.8,74,12000,55,12000,"","","",1245,""]
["A4 Alnarpsån, Coyetgården44242","A4 Alnarpsån, Coyetgården2",32,"A4 Alnarpsån, Coyetgården","2021-02-15","",0.1,18.5,127,8.36,8,88.1,"",3.4,130,6100,300,6300,"","","",1330,"istäckt"]
["A4 Alnarpsån, Coyetgården44305","A4 Alnarpsån, Coyetgården4",32,"A4 Alnarpsån, Coyetgården","2021-04-19","",8.6,8.6,74,8.17,1.4,86.1,"",3.2,16,3800,"<10",4400,"","","",815,""]
["A4 Alnarpsån, Coyetgården44362","A4 Alnarpsån, Coyetgården6",32,"A4 Alnarpsån, Coyetgården","2021-06-15","",14.3,9.6,94,8.06,2.1,97,"",5.2,97,1200,100,1600,"","","",730,""]
["A4 Alnarpsån, Coyetgården44427","A4 Alnarpsån, Coyetgården8",32,"A4 Alnarpsån, Coyetgården","2021-08-19","",13.7,6.1,59,8.1999999999999993,2.2999999999999998,49.5,"",5.6,72,470,17,800,"","","",1100,""]
["A4 Alnarpsån, Coyetgården44489","A4 Alnarpsån, Coyetgården10",32,"A4 Alnarpsån, Coyetgården","2021-10-20","",13.2,9.1,87,7.75,6,49.1,"",5.2,110,1000,25,1500,"","","",1130,""]
["A4 Alnarpsån, Coyetgården44550","A4 Alnarpsån, Coyetgården12",32,"A4 Alnarpsån, Coyetgården","2021-12-20","",5.3,12.2,96,8.17,2.2000000000000002,88.1,"",3.4,90,11000,19,11000,"","","",1230,""]
["","1",200]
["","1",200,null,null,null,null,null,null,null,null,null,null,null,null,null,null,"","","","",""]
["","1",200]
["","1",200]
["","1",200]
["","1",200]
["","1",200]
["","1",200]
["","1",200]
[{"$f":"TRIM(CONCATENATE(D99,E99))","v":"april"},"april1",250,"april"]
["maj","maj1",250,"maj"]
["juni","juni1",250,"juni"]
["juli","juli1",250,"juli"]
["augusti","augusti1",250,"augusti"]
["september","september1",250,"september"]
["oktober","oktober1",250,"oktober"]
["december","december1",250,"december"]
["","1"]
["","1"]
["","1"]
["","1"]
[{"$f":"TRIM(CONCATENATE(D111,E111))","v":""},{"$f":"CONCATENATE(D111,MONTH(E111))","v":"1"}]
["","1"]
["","1"]
["","1"]
["","1"]
["","1"]
["","1"]
["","1"]
["","1"]
["","1"]
["","1"]
["","1"]
["","1"]
["","1"]
["","1"]
["","1"]
["","1"]
["","1"]
["","1"]
["","1"]
["","1"]
["","1"]
["","1"]
["","1"]
["","1"]
["","1"]
["","1"]
["","1"]
["","1"]
["","1"]
["","1"]
["","1"]
["","1"]
["","1"]
["","1"]
["","1"]
["","1"]
["","1"]
["","1"]
["","1"]
["","1"]
["","1"]
["","1"]
["","1"]
["","1"]
["","1"]
["","1"]
["","1"]
["","1"]
["","1"]
["","1"]
["","1"]
["","1"]
["","1"]
["","1"]
["","1"]
["","1"]
["","1"]
["","1"]
["","1"]

{"sheet":"Sorterat","index":3,"n_rows":155,"n_cols":53,"rows_kept":155,"cut":false,"hidden":false,"merged":[[4,22,4,23]]}
[]
[null,"Sege å 2021"]
[null,"Sorterat per provpunkt"]
[null,null,null,"Värden < a räknas som a vid beräkning av statistik",null,null,null,null,null,null,null,null,null,null,null,null,null,null,null,null,null,null,null,null,null,null,null,null,null,null,null,null,null,null,"<-värden omvandlade till värden. Medelvärde hämtas här"]
["Sorterings-","Provtagningspunkt","Provtagn"," Vattenf"," Temp"," Syreh","Syrem","  pH","Gruml","  Kond","BOD7","TOC","Tot-P"," NO3+2-N","NH4-N"," Tot-N","Klor a","Siktdj VK","Siktdj","   Tid","Anmärkning","provtagare/projektledare",null,null,null,null,null,null,null,null,null,null,null,null," Vattenf"," Temp"," Syreh","Syrem","  pH","Gruml","  Kond","BOD7","PO4-P","Tot-P"," NO3+2-N","NH4-N"," Tot-N","Abs,filt","Klor a","Siktdjup","Het-bakt.","E coli","Int.het."]
["ordning","Nr Läge","datum","    m3/s","  °C","mg/l","%",null,"  FNU","mS/m","mg/l","mg/l"," µg/l","  µg/l","  µg/l","  µg/l","mg/m3","m","m",null,null,null,null,null,null,null,null,null,null,null,null,null,null,null,"    m3/s","  °C","mg/l","%",null,"  FNU","mS/m","mg/l"," µg/l"," µg/l","  µg/l","  µg/l","  µg/l","/5cm","mg/m3","m","cfu/ml","cfu/100ml","cfu/100 ml"]
[3,"1  Sege å, vid Brännemölla, uppströms Svedala AR","2021-02-15","",0.4,14,97,7.78,12,50.4,4.9000000000000004,22,65,1800,250,3600,"","","",1545,"is i kanten ",null,null,null,null,null,null,null,null,null,null,null,null,null,"",0.4,14,97,7.78,12,50.4,{"$f":"IF(OR(LEFT(K7,1)=\"<\",LEFT(K7,1)=\">\"),VALUE(MID(K7,2,5)),K7)","v":4.9000000000000004},{"$f":"IF(OR(LEFT(L7,1)=\"<\",LEFT(L7,1)=\">\"),VALUE(MID(L7,2,5)),L7)","v":22},{"$f":"IF(OR(LEFT(M7,1)=\"<\",LEFT(M7,1)=\">\"),VALUE(MID(M7,2,5)),M7)","v":65},{"$f":"IF(OR(LEFT(N7,1)=\"<\",LEFT(N7,1)=\">\"),VALUE(MID(N7,2,5)),N7)","v":1800},{"$f":"IF(OR(LEFT(O7,1)=\"<\",LEFT(O7,1)=\">\"),VALUE(MID(O7,2,5)),O7)","v":250},{"$f":"IF(OR(LEFT(P7,1)=\"<\",LEFT(P7,1)=\">\"),VALUE(MID(P7,2,5)),P7)","v":3600},{"$f":"IF(OR(LEFT(Q7,1)=\"<\",LEFT(Q7,1)=\">\"),VALUE(MID(Q7,2,5)),Q7)","v":""},{"$f":"IF(OR(LEFT(R7,1)=\"<\",LEFT(R7,1)=\">\"),VALUE(MID(R7,2,5)),R7)","v":""},{"$f":"IF(OR(LEFT(S7,1)=\"<\",LEFT(S7,1)=\">\"),VALUE(MID(S7,2,5)),S7)","v":""},{"$f":"IF(OR(LEFT(#REF!,1)=\"<\",LEFT(#REF!,1)=\">\"),VALUE(MID(#REF!,2,5)),#REF!)","v":{"$error":"#REF!"}},{"$f":"IF(OR(LEFT(#REF!,1)=\"<\",LEFT(#REF!,1)=\">\"),VALUE(MID(#REF!,2,5)),#REF!)","v":{"$error":"#REF!"}},{"$f":"IF(OR(LEFT(#REF!,1)=\"<\",LEFT(#REF!,1)=\">\"),VALUE(MID(#REF!,2,5)),#REF!)","v":{"$error":"#REF!"}}]
[3,"1  Sege å, vid Brännemölla, uppströms Svedala AR","2021-04-19","",9.8000000000000007,11.2,99,7.81,11,47.7,6.3,22,66,1300,"<10",2900,"","","",1050,"grumligt ",null,null,null,null,null,null,null,null,null,null,null,null,null,"",9.8000000000000007,11.2,99,7.81,11,47.7,6.3,22,66,1300,10,2900,"","","",{"$f":"IF(OR(LEFT(#REF!,1)=\"<\",LEFT(#REF!,1)=\">\"),VALUE(MID(#REF!,2,5)),#REF!)","v":{"$error":"#REF!"}},{"$f":"IF(OR(LEFT(#REF!,1)=\"<\",LEFT(#REF!,1)=\">\"),VALUE(MID(#REF!,2,5)),#REF!)","v":{"$error":"#REF!"}},{"$f":"IF(OR(LEFT(#REF!,1)=\"<\",LEFT(#REF!,1)=\">\"),VALUE(MID(#REF!,2,5)),#REF!)","v":{"$error":"#REF!"}}]
[3,"1  Sege å, vid Brännemölla, uppströms Svedala AR","2021-06-15","",16.399999999999999,4.3,44,7.41,18,45.3,7.7,26,160,590,250,3300,"","","",1000,"grumligt",null,null,null,null,null,null,null,null,null,null,null,null,null,"",16.399999999999999,4.3,44,7.41,18,45.3,7.7,26,160,590,250,3300,"","","",{"$f":"IF(OR(LEFT(#REF!,1)=\"<\",LEFT(#REF!,1)=\">\"),VALUE(MID(#REF!,2,5)),#REF!)","v":{"$error":"#REF!"}},{"$f":"IF(OR(LEFT(#REF!,1)=\"<\",LEFT(#REF!,1)=\">\"),VALUE(MID(#REF!,2,5)),#REF!)","v":{"$error":"#REF!"}},{"$f":"IF(OR(LEFT(#REF!,1)=\"<\",LEFT(#REF!,1)=\">\"),VALUE(MID(#REF!,2,5)),#REF!)","v":{"$error":"#REF!"}}]
[3,"1  Sege å, vid Brännemölla, uppströms Svedala AR","2021-08-19","",14.5,8.5,84,7.5,14,50.2,5.6,22,120,1100,130,3000,"","","",1310,"",null,null,null,null,null,null,null,null,null,null,null,null,null,"",14.5,8.5,84,7.5,14,50.2,5.6,22,120,1100,130,3000,"","","",{"$f":"IF(OR(LEFT(#REF!,1)=\"<\",LEFT(#REF!,1)=\">\"),VALUE(MID(#REF!,2,5)),#REF!)","v":{"$error":"#REF!"}},{"$f":"IF(OR(LEFT(#REF!,1)=\"<\",LEFT(#REF!,1)=\">\"),VALUE(MID(#REF!,2,5)),#REF!)","v":{"$error":"#REF!"}},{"$f":"IF(OR(LEFT(#REF!,1)=\"<\",LEFT(#REF!,1)=\">\"),VALUE(MID(#REF!,2,5)),#REF!)","v":{"$error":"#REF!"}}]
[3,"1  Sege å, vid Brännemölla, uppströms Svedala AR","2021-10-20","",11.5,7.5,69,7.62,76,54.5,5.7,21,210,5600,48,7700,"","","",1400,"",null,null,null,null,null,null,null,null,null,null,null,null,null,"",11.5,7.5,69,7.62,76,54.5,5.7,21,210,5600,48,7700,"","","",{"$f":"IF(OR(LEFT(#REF!,1)=\"<\",LEFT(#REF!,1)=\">\"),VALUE(MID(#REF!,2,5)),#REF!)","v":{"$error":"#REF!"}},{"$f":"IF(OR(LEFT(#REF!,1)=\"<\",LEFT(#REF!,1)=\">\"),VALUE(MID(#REF!,2,5)),#REF!)","v":{"$error":"#REF!"}},{"$f":"IF(OR(LEFT(#REF!,1)=\"<\",LEFT(#REF!,1)=\">\"),VALUE(MID(#REF!,2,5)),#REF!)","v":{"$error":"#REF!"}}]
[3,"1  Sege å, vid Brännemölla, uppströms Svedala AR","2021-12-20","",1.3,10.5,74,7.58,20,45.8,5.8,24,120,1900,650,4400,"","","",1430,"",null,null,null,null,null,null,null,null,null,null,null,null,null,"",1.3,10.5,74,7.58,20,45.8,5.8,24,120,1900,650,4400,"","","",{"$f":"IF(OR(LEFT(#REF!,1)=\"<\",LEFT(#REF!,1)=\">\"),VALUE(MID(#REF!,2,5)),#REF!)","v":{"$error":"#REF!"}},{"$f":"IF(OR(LEFT(#REF!,1)=\"<\",LEFT(#REF!,1)=\">\"),VALUE(MID(#REF!,2,5)),#REF!)","v":{"$error":"#REF!"}},{"$f":"IF(OR(LEFT(#REF!,1)=\"<\",LEFT(#REF!,1)=\">\"),VALUE(MID(#REF!,2,5)),#REF!)","v":{"$error":"#REF!"}}]
[null,null,"Medel",null,8.9833333333333325,9.3333333333333339,77.833333333333329,7.6166666666666663,25.166666666666668,48.983333333333327,6,22.833333333333332,123.5,2048.3333333333335,223,4150,null,null,null,null,null,null,null,null,null,null,null,null,null,null,null,null,null,null,0,8.9833333333333325,9.3333333333333339,77.833333333333329,7.6166666666666663,25.166666666666668,48.983333333333327,6,22.833333333333332,123.5,2048.3333333333335,223,4150,0,0,0,{"$f":"IF(OR(LEFT(#REF!,1)=\"<\",LEFT(#REF!,1)=\">\"),VALUE(MID(#REF!,2,5)),#REF!)","v":{"$error":"#REF!"}},{"$f":"IF(OR(LEFT(#REF!,1)=\"<\",LEFT(#REF!,1)=\">\"),VALUE(MID(#REF!,2,5)),#REF!)","v":{"$error":"#REF!"}},{"$f":"IF(OR(LEFT(#REF!,1)=\"<\",LEFT(#REF!,1)=\">\"),VALUE(MID(#REF!,2,5)),#REF!)","v":{"$error":"#REF!"}}]
[null,null,"Max",null,16.399999999999999,14,99,7.81,76,54.5,7.7,26,210,5600,650,7700,null,null,null,null,null,null,null,null,null,null,null,null,null,null,null,null,null,null,0,16.399999999999999,14,99,7.81,76,54.5,7.7,26,210,5600,650,7700,0,0,0,{"$f":"IF(OR(LEFT(#REF!,1)=\"<\",LEFT(#REF!,1)=\">\"),VALUE(MID(#REF!,2,5)),#REF!)","v":{"$error":"#REF!"}},{"$f":"IF(OR(LEFT(#REF!,1)=\"<\",LEFT(#REF!,1)=\">\"),VALUE(MID(#REF!,2,5)),#REF!)","v":{"$error":"#REF!"}},{"$f":"IF(OR(LEFT(#REF!,1)=\"<\",LEFT(#REF!,1)=\">\"),VALUE(MID(#REF!,2,5)),#REF!)","v":{"$error":"#REF!"}}]
[null,null,"Min",null,0.4,4.3,44,7.41,11,45.3,4.9000000000000004,21,65,590,10,2900,null,null,null,null,null,null,null,null,null,null,null,null,null,null,null,null,null,null,0,0.4,4.3,44,7.41,11,45.3,4.9000000000000004,21,65,590,10,2900,0,0,0,{"$f":"IF(OR(LEFT(#REF!,1)=\"<\",LEFT(#REF!,1)=\">\"),VALUE(MID(#REF!,2,5)),#REF!)","v":{"$error":"#REF!"}},{"$f":"IF(OR(LEFT(#REF!,1)=\"<\",LEFT(#REF!,1)=\">\"),VALUE(MID(#REF!,2,5)),#REF!)","v":{"$error":"#REF!"}},{"$f":"IF(OR(LEFT(#REF!,1)=\"<\",LEFT(#REF!,1)=\">\"),VALUE(MID(#REF!,2,5)),#REF!)","v":{"$error":"#REF!"}}]
[null,null,null,null,null,null,null,null,null,null,null,null,null,null,null,null,null,null,null,null,null,null,null,null,null,null,null,null,null,null,null,null,null,null,0,0,0,0,0,0,0,0,0,0,0,0,0,0,0,0,{"$f":"IF(OR(LEFT(#REF!,1)=\"<\",LEFT(#REF!,1)=\">\"),VALUE(MID(#REF!,2,5)),#REF!)","v":{"$error":"#REF!"}},{"$f":"IF(OR(LEFT(#REF!,1)=\"<\",LEFT(#REF!,1)=\">\"),VALUE(MID(#REF!,2,5)),#REF!)","v":{"$error":"#REF!"}},{"$f":"IF(OR(LEFT(#REF!,1)=\"<\",LEFT(#REF!,1)=\">\"),VALUE(MID(#REF!,2,5)),#REF!)","v":{"$error":"#REF!"}}]
[5,"2  Sege å, söder Krågeholm, nedströms Svedala AR","2021-02-15",0.49,1.2,13.5,95,7.8,15,54.2,5,19,86,2900,300,4100,"","","",1600,"is i kanten ",null,null,null,null,null,null,null,null,null,null,null,null,null,0.49,1.2,13.5,95,7.8,15,54.2,5,19,86,2900,300,4100,"","","",{"$f":"IF(OR(LEFT(#REF!,1)=\"<\",LEFT(#REF!,1)=\">\"),VALUE(MID(#REF!,2,5)),#REF!)","v":{"$error":"#REF!"}},{"$f":"IF(OR(LEFT(#REF!,1)=\"<\",LEFT(#REF!,1)=\">\"),VALUE(MID(#REF!,2,5)),#REF!)","v":{"$error":"#REF!"}},{"$f":"IF(OR(LEFT(#REF!,1)=\"<\",LEFT(#REF!,1)=\">\"),VALUE(MID(#REF!,2,5)),#REF!)","v":{"$error":"#REF!"}}]
[5,"2  Sege å, söder Krågeholm, nedströms Svedala AR","2021-04-19",0.41,9.5,12,105,7.89,11,56.8,6.1,18,69,2100,68,3400,"","","",1030,"grumligt ",null,null,null,null,null,null,null,null,null,null,null,null,null,0.41,9.5,12,105,7.89,11,56.8,6.1,18,69,2100,68,3400,"","","",{"$f":"IF(OR(LEFT(#REF!,1)=\"<\",LEFT(#REF!,1)=\">\"),VALUE(MID(#REF!,2,5)),#REF!)","v":{"$error":"#REF!"}},{"$f":"IF(OR(LEFT(#REF!,1)=\"<\",LEFT(#REF!,1)=\">\"),VALUE(MID(#REF!,2,5)),#REF!)","v":{"$error":"#REF!"}},{"$f":"IF(OR(LEFT(#REF!,1)=\"<\",LEFT(#REF!,1)=\">\"),VALUE(MID(#REF!,2,5)),#REF!)","v":{"$error":"#REF!"}}]
[5,"2  Sege å, söder Krågeholm, nedströms Svedala AR","2021-06-15",0.06,16.399999999999999,8,82,7.76,15,63.8,7.6,16,150,1100,700,3400,"","","",1020,"grumligt",null,null,null,null,null,null,null,null,null,null,null,null,null,0.06,16.399999999999999,8,82,7.76,15,63.8,7.6,16,150,1100,700,3400,"","","",{"$f":"IF(OR(LEFT(#REF!,1)=\"<\",LEFT(#REF!,1)=\">\"),VALUE(MID(#REF!,2,5)),#REF!)","v":{"$error":"#REF!"}},{"$f":"IF(OR(LEFT(#REF!,1)=\"<\",LEFT(#REF!,1)=\">\"),VALUE(MID(#REF!,2,5)),#REF!)","v":{"$error":"#REF!"}},{"$f":"IF(OR(LEFT(#REF!,1)=\"<\",LEFT(#REF!,1)=\">\"),VALUE(MID(#REF!,2,5)),#REF!)","v":{"$error":"#REF!"}}]
[5,"2  Sege å, söder Krågeholm, nedströms Svedala AR","2021-08-19",0.17,16.5,8.5,87,7.71,7.2,44.9,4,11,120,1300,76,2300,"","","",1330,"",null,null,null,null,null,null,null,null,null,null,null,null,null,0.17,16.5,8.5,87,7.71,7.2,44.9,4,11,120,1300,76,2300,"","","",{"$f":"IF(OR(LEFT(#REF!,1)=\"<\",LEFT(#REF!,1)=\">\"),VALUE(MID(#REF!,2,5)),#REF!)","v":{"$error":"#REF!"}},{"$f":"IF(OR(LEFT(#REF!,1)=\"<\",LEFT(#REF!,1)=\">\"),VALUE(MID(#REF!,2,5)),#REF!)","v":{"$error":"#REF!"}},{"$f":"IF(OR(LEFT(#REF!,1)=\"<\",LEFT(#REF!,1)=\">\"),VALUE(MID(#REF!,2,5)),#REF!)","v":{"$error":"#REF!"}}]
[5,"2  Sege å, söder Krågeholm, nedströms Svedala AR","2021-10-20",0.23,12.9,7.9,75,7.61,39,54.1,4.5999999999999996,11,150,2900,160,4400,"","","",1430,"",null,null,null,null,null,null,null,null,null,null,null,null,null,0.23,12.9,7.9,75,7.61,39,54.1,4.5999999999999996,11,150,2900,160,4400,"","","",{"$f":"IF(OR(LEFT(#REF!,1)=\"<\",LEFT(#REF!,1)=\">\"),VALUE(MID(#REF!,2,5)),#REF!)","v":{"$error":"#REF!"}},{"$f":"IF(OR(LEFT(#REF!,1)=\"<\",LEFT(#REF!,1)=\">\"),VALUE(MID(#REF!,2,5)),#REF!)","v":{"$error":"#REF!"}},{"$f":"IF(OR(LEFT(#REF!,1)=\"<\",LEFT(#REF!,1)=\">\"),VALUE(MID(#REF!,2,5)),#REF!)","v":{"$error":"#REF!"}}]
[5,"2  Sege å, söder Krågeholm, nedströms Svedala AR","2021-12-20",1.1000000000000001,2.7,11.5,85,7.66,19,52.2,6.6,17,170,2700,580,4800,"","","",1445,"",null,null,null,null,null,null,null,null,null,null,null,null,null,1.1000000000000001,2.7,11.5,85,7.66,19,52.2,6.6,17,170,2700,580,4800,"","","",{"$f":"IF(OR(LEFT(#REF!,1)=\"<\",LEFT(#REF!,1)=\">\"),VALUE(MID(#REF!,2,5)),#REF!)","v":{"$error":"#REF!"}},{"$f":"IF(OR(LEFT(#REF!,1)=\"<\",LEFT(#REF!,1)=\">\"),VALUE(MID(#REF!,2,5)),#REF!)","v":{"$error":"#REF!"}},{"$f":"IF(OR(LEFT(#REF!,1)=\"<\",LEFT(#REF!,1)=\">\"),VALUE(MID(#REF!,2,5)),#REF!)","v":{"$error":"#REF!"}}]
[null,null,"Medel",0.41,9.8666666666666654,10.233333333333333,88.166666666666671,7.7383333333333342,17.7,54.333333333333336,5.6499999999999995,15.333333333333334,124.16666666666667,2166.6666666666665,314,3733.3333333333335,null,null,null,null,null,null,null,null,null,null,null,null,null,null,null,null,null,null,0.41,9.8666666666666654,10.233333333333333,88.166666666666671,7.7383333333333342,17.7,54.333333333333336,5.6499999999999995,15.333333333333334,124.16666666666667,2166.6666666666665,314,3733.3333333333335,0,0,0,{"$f":"IF(OR(LEFT(#REF!,1)=\"<\",LEFT(#REF!,1)=\">\"),VALUE(MID(#REF!,2,5)),#REF!)","v":{"$error":"#REF!"}},{"$f":"IF(OR(LEFT(#REF!,1)=\"<\",LEFT(#REF!,1)=\">\"),VALUE(MID(#REF!,2,5)),#REF!)","v":{"$error":"#REF!"}},{"$f":"IF(OR(LEFT(#REF!,1)=\"<\",LEFT(#REF!,1)=\">\"),VALUE(MID(#REF!,2,5)),#REF!)","v":{"$error":"#REF!"}}]
[null,null,"Max",1.1000000000000001,16.5,13.5,105,7.89,39,63.8,7.6,19,170,2900,700,4800,null,null,null,null,null,null,null,null,null,null,null,null,null,null,null,null,null,null,1.1000000000000001,16.5,13.5,105,7.89,39,63.8,7.6,19,170,2900,700,4800,0,0,0,{"$f":"IF(OR(LEFT(#REF!,1)=\"<\",LEFT(#REF!,1)=\">\"),VALUE(MID(#REF!,2,5)),#REF!)","v":{"$error":"#REF!"}},{"$f":"IF(OR(LEFT(#REF!,1)=\"<\",LEFT(#REF!,1)=\">\"),VALUE(MID(#REF!,2,5)),#REF!)","v":{"$error":"#REF!"}},{"$f":"IF(OR(LEFT(#REF!,1)=\"<\",LEFT(#REF!,1)=\">\"),VALUE(MID(#REF!,2,5)),#REF!)","v":{"$error":"#REF!"}}]
[null,null,"Min",0.06,1.2,7.9,75,7.61,7.2,44.9,4,11,69,1100,68,2300,null,null,null,null,null,null,null,null,null,null,null,null,null,null,null,null,null,null,0.06,1.2,7.9,75,7.61,7.2,44.9,4,11,69,1100,68,2300,0,0,0,{"$f":"IF(OR(LEFT(#REF!,1)=\"<\",LEFT(#REF!,1)=\">\"),VALUE(MID(#REF!,2,5)),#REF!)","v":{"$error":"#REF!"}},{"$f":"IF(OR(LEFT(#REF!,1)=\"<\",LEFT(#REF!,1)=\">\"),VALUE(MID(#REF!,2,5)),#REF!)","v":{"$error":"#REF!"}},{"$f":"IF(OR(LEFT(#REF!,1)=\"<\",LEFT(#REF!,1)=\">\"),VALUE(MID(#REF!,2,5)),#REF!)","v":{"$error":"#REF!"}}]
[null,null,null,null,null,null,null,null,null,null,null,null,null,null,null,null,null,null,null,null,null,null,null,null,null,null,null,null,null,null,null,null,null,null,0,0,0,0,0,0,0,0,0,0,0,0,0,0,0,0,{"$f":"IF(OR(LEFT(#REF!,1)=\"<\",LEFT(#REF!,1)=\">\"),VALUE(MID(#REF!,2,5)),#REF!)","v":{"$error":"#REF!"}},{"$f":"IF(OR(LEFT(#REF!,1)=\"<\",LEFT(#REF!,1)=\">\"),VALUE(MID(#REF!,2,5)),#REF!)","v":{"$error":"#REF!"}},{"$f":"IF(OR(LEFT(#REF!,1)=\"<\",LEFT(#REF!,1)=\">\"),VALUE(MID(#REF!,2,5)),#REF!)","v":{"$error":"#REF!"}}]
[7,"9  Sege å, vid Lilla Mölleberga","2021-02-15","",0,14,96,7.92,11,68.3,"",16,83,3300,300,3900,"","","",1445,"istäckt",null,null,null,null,null,null,null,null,null,null,null,null,null,"",0,14,96,7.92,11,68.3,"",16,83,3300,300,3900,"","","",{"$f":"IF(OR(LEFT(#REF!,1)=\"<\",LEFT(#REF!,1)=\">\"),VALUE(MID(#REF!,2,5)),#REF!)","v":{"$error":"#REF!"}},{"$f":"IF(OR(LEFT(#REF!,1)=\"<\",LEFT(#REF!,1)=\">\"),VALUE(MID(#REF!,2,5)),#REF!)","v":{"$error":"#REF!"}},{"$f":"IF(OR(LEFT(#REF!,1)=\"<\",LEFT(#REF!,1)=\">\"),VALUE(MID(#REF!,2,5)),#REF!)","v":{"$error":"#REF!"}}]
[7,"9  Sege å, vid Lilla Mölleberga","2021-04-19","",9.5,11,97,8,8.1999999999999993,63.8,"",15,77,2100,"<10",2900,"","","",920,"",null,null,null,null,null,null,null,null,null,null,null,null,null,"",9.5,11,97,8,8.1999999999999993,63.8,"",15,77,2100,10,2900,"","","",{"$f":"IF(OR(LEFT(#REF!,1)=\"<\",LEFT(#REF!,1)=\">\"),VALUE(MID(#REF!,2,5)),#REF!)","v":{"$error":"#REF!"}},{"$f":"IF(OR(LEFT(#REF!,1)=\"<\",LEFT(#REF!,1)=\">\"),VALUE(MID(#REF!,2,5)),#REF!)","v":{"$error":"#REF!"}},{"$f":"IF(OR(LEFT(#REF!,1)=\"<\",LEFT(#REF!,1)=\">\"),VALUE(MID(#REF!,2,5)),#REF!)","v":{"$error":"#REF!"}}]
[7,"9  Sege å, vid Lilla Mölleberga","2021-06-15","",16.600000000000001,7.6,78,7.81,8.8000000000000007,65.599999999999994,"",13,120,1100,39,2100,"","","",845,"",null,null,null,null,null,null,null,null,null,null,null,null,null,"",16.600000000000001,7.6,78,7.81,8.8000000000000007,65.599999999999994,"",13,120,1100,39,2100,"","","",{"$f":"IF(OR(LEFT(#REF!,1)=\"<\",LEFT(#REF!,1)=\">\"),VALUE(MID(#REF!,2,5)),#REF!)","v":{"$error":"#REF!"}},{"$f":"IF(OR(LEFT(#REF!,1)=\"<\",LEFT(#REF!,1)=\">\"),VALUE(MID(#REF!,2,5)),#REF!)","v":{"$error":"#REF!"}},{"$f":"IF(OR(LEFT(#REF!,1)=\"<\",LEFT(#REF!,1)=\">\"),VALUE(MID(#REF!,2,5)),#REF!)","v":{"$error":"#REF!"}}]
[7,"9  Sege å, vid Lilla Mölleberga","2021-08-19","",15,7,70,7.7,6.3,35.4,"",7.7,120,920,83,1600,"","","",1220,"",null,null,null,null,null,null,null,null,null,null,null,null,null,"",15,7,70,7.7,6.3,35.4,"",7.7,120,920,83,1600,"","","",{"$f":"IF(OR(LEFT(#REF!,1)=\"<\",LEFT(#REF!,1)=\">\"),VALUE(MID(#REF!,2,5)),#REF!)","v":{"$error":"#REF!"}},{"$f":"IF(OR(LEFT(#REF!,1)=\"<\",LEFT(#REF!,1)=\">\"),VALUE(MID(#REF!,2,5)),#REF!)","v":{"$error":"#REF!"}},{"$f":"IF(OR(LEFT(#REF!,1)=\"<\",LEFT(#REF!,1)=\">\"),VALUE(MID(#REF!,2,5)),#REF!)","v":{"$error":"#REF!"}}]
[7,"9  Sege å, vid Lilla Mölleberga","2021-10-20","",11.9,8.1,75,7.9,5.6,66.2,"",8.3000000000000007,81,2000,18,2900,"","","",1255,"",null,null,null,null,null,null,null,null,null,null,null,null,null,"",11.9,8.1,75,7.9,5.6,66.2,"",8.3000000000000007,81,2000,18,2900,"","","",{"$f":"IF(OR(LEFT(#REF!,1)=\"<\",LEFT(#REF!,1)=\">\"),VALUE(MID(#REF!,2,5)),#REF!)","v":{"$error":"#REF!"}},{"$f":"IF(OR(LEFT(#REF!,1)=\"<\",LEFT(#REF!,1)=\">\"),VALUE(MID(#REF!,2,5)),#REF!)","v":{"$error":"#REF!"}},{"$f":"IF(OR(LEFT(#REF!,1)=\"<\",LEFT(#REF!,1)=\">\"),VALUE(MID(#REF!,2,5)),#REF!)","v":{"$error":"#REF!"}}]
[7,"9  Sege å, vid Lilla Mölleberga","2021-12-20","",2.9,12.2,90,7.97,12,61.3,"",16,93,3600,310,4200,"","","",1330,"",null,null,null,null,null,null,null,null,null,null,null,null,null,"",2.9,12.2,90,7.97,12,61.3,"",16,93,3600,310,4200,"","","",{"$f":"IF(OR(LEFT(#REF!,1)=\"<\",LEFT(#REF!,1)=\">\"),VALUE(MID(#REF!,2,5)),#REF!)","v":{"$error":"#REF!"}},{"$f":"IF(OR(LEFT(#REF!,1)=\"<\",LEFT(#REF!,1)=\">\"),VALUE(MID(#REF!,2,5)),#REF!)","v":{"$error":"#REF!"}},{"$f":"IF(OR(LEFT(#REF!,1)=\"<\",LEFT(#REF!,1)=\">\"),VALUE(MID(#REF!,2,5)),#REF!)","v":{"$error":"#REF!"}}]
[null,null,"Medel",null,9.3166666666666664,9.9833333333333343,84.333333333333329,7.8833333333333329,8.65,60.1,null,12.666666666666666,95.666666666666671,2170,126.66666666666667,2933.3333333333335,null,null,null,null,null,null,null,null,null,null,null,null,null,null,null,null,null,null,0,9.3166666666666664,9.9833333333333343,84.333333333333329,7.8833333333333329,8.65,60.1,0,12.666666666666666,95.666666666666671,2170,126.66666666666667,2933.3333333333335,0,0,0,{"$f":"IF(OR(LEFT(#REF!,1)=\"<\",LEFT(#REF!,1)=\">\"),VALUE(MID(#REF!,2,5)),#REF!)","v":{"$error":"#REF!"}},{"$f":"IF(OR(LEFT(#REF!,1)=\"<\",LEFT(#REF!,1)=\">\"),VALUE(MID(#REF!,2,5)),#REF!)","v":{"$error":"#REF!"}},{"$f":"IF(OR(LEFT(#REF!,1)=\"<\",LEFT(#REF!,1)=\">\"),VALUE(MID(#REF!,2,5)),#REF!)","v":{"$error":"#REF!"}}]
[null,null,"Max",null,16.600000000000001,14,97,8,12,68.3,null,16,120,3600,310,4200,null,null,null,null,null,null,null,null,null,null,null,null,null,null,null,null,null,null,0,16.600000000000001,14,97,8,12,68.3,0,16,120,3600,310,4200,0,0,0,{"$f":"IF(OR(LEFT(#REF!,1)=\"<\",LEFT(#REF!,1)=\">\"),VALUE(MID(#REF!,2,5)),#REF!)","v":{"$error":"#REF!"}},{"$f":"IF(OR(LEFT(#REF!,1)=\"<\",LEFT(#REF!,1)=\">\"),VALUE(MID(#REF!,2,5)),#REF!)","v":{"$error":"#REF!"}},{"$f":"IF(OR(LEFT(#REF!,1)=\"<\",LEFT(#REF!,1)=\">\"),VALUE(MID(#REF!,2,5)),#REF!)","v":{"$error":"#REF!"}}]
[null,null,"Min",null,0,7,70,7.7,5.6,35.4,null,7.7,77,920,10,1600,null,null,null,null,null,null,null,null,null,null,null,null,null,null,null,null,null,null,0,0,7,70,7.7,5.6,35.4,0,7.7,77,920,10,1600,0,0,0,{"$f":"IF(OR(LEFT(#REF!,1)=\"<\",LEFT(#REF!,1)=\">\"),VALUE(MID(#REF!,2,5)),#REF!)","v":{"$error":"#REF!"}},{"$f":"IF(OR(LEFT(#REF!,1)=\"<\",LEFT(#REF!,1)=\">\"),VALUE(MID(#REF!,2,5)),#REF!)","v":{"$error":"#REF!"}},{"$f":"IF(OR(LEFT(#REF!,1)=\"<\",LEFT(#REF!,1)=\">\"),VALUE(MID(#REF!,2,5)),#REF!)","v":{"$error":"#REF!"}}]
[null,null,null,null,null,null,null,null,null,null,null,null,null,null,null,null,null,null,null,null,null,null,null,null,null,null,null,null,null,null,null,null,null,null,0,0,0,0,0,0,0,0,0,0,0,0,0,0,0,0,{"$f":"IF(OR(LEFT(#REF!,1)=\"<\",LEFT(#REF!,1)=\">\"),VALUE(MID(#REF!,2,5)),#REF!)","v":{"$error":"#REF!"}},{"$f":"IF(OR(LEFT(#REF!,1)=\"<\",LEFT(#REF!,1)=\">\"),VALUE(MID(#REF!,2,5)),#REF!)","v":{"$error":"#REF!"}},{"$f":"IF(OR(LEFT(#REF!,1)=\"<\",LEFT(#REF!,1)=\">\"),VALUE(MID(#REF!,2,5)),#REF!)","v":{"$error":"#REF!"}}]
[9,"18 Sege å, nordväst Valdemarsro, järnvägsbron","2021-02-15","",0.1,13.5,92,7.89,14,78.2,"",14,99,4300,240,4800,"","","",1400,"is i kanten ",null,null,null,null,null,null,null,null,null,null,null,null,null,"",0.1,13.5,92,7.89,14,78.2,"",14,99,4300,240,4800,"","","",{"$f":"IF(OR(LEFT(#REF!,1)=\"<\",LEFT(#REF!,1)=\">\"),VALUE(MID(#REF!,2,5)),#REF!)","v":{"$error":"#REF!"}},{"$f":"IF(OR(LEFT(#REF!,1)=\"<\",LEFT(#REF!,1)=\">\"),VALUE(MID(#REF!,2,5)),#REF!)","v":{"$error":"#REF!"}},{"$f":"IF(OR(LEFT(#REF!,1)=\"<\",LEFT(#REF!,1)=\">\"),VALUE(MID(#REF!,2,5)),#REF!)","v":{"$error":"#REF!"}}]
[9,"18 Sege å, nordväst Valdemarsro, järnvägsbron","2021-04-19","",9.5,10.4,91,8,6.7,70.099999999999994,"",13,62,2400,14,3200,"","","",840,"",null,null,null,null,null,null,null,null,null,null,null,null,null,"",9.5,10.4,91,8,6.7,70.099999999999994,"",13,62,2400,14,3200,"","","",{"$f":"IF(OR(LEFT(#REF!,1)=\"<\",LEFT(#REF!,1)=\">\"),VALUE(MID(#REF!,2,5)),#REF!)","v":{"$error":"#REF!"}},{"$f":"IF(OR(LEFT(#REF!,1)=\"<\",LEFT(#REF!,1)=\">\"),VALUE(MID(#REF!,2,5)),#REF!)","v":{"$error":"#REF!"}},{"$f":"IF(OR(LEFT(#REF!,1)=\"<\",LEFT(#REF!,1)=\">\"),VALUE(MID(#REF!,2,5)),#REF!)","v":{"$error":"#REF!"}}]
[9,"18 Sege å, nordväst Valdemarsro, järnvägsbron","2021-06-15","",17.2,5.7,59,7.78,4.0999999999999996,73.5,"",12,94,850,87,1700,"","","",810,"",null,null,null,null,null,null,null,null,null,null,null,null,null,"",17.2,5.7,59,7.78,4.0999999999999996,73.5,{"$f":"IF(OR(LEFT(K39,1)=\"<\",LEFT(K39,1)=\">\"),VALUE(MID(K39,2,5)),K39)","v":""},{"$f":"IF(OR(LEFT(L39,1)=\"<\",LEFT(L39,1)=\">\"),VALUE(MID(L39,2,5)),L39)","v":12},{"$f":"IF(OR(LEFT(M39,1)=\"<\",LEFT(M39,1)=\">\"),VALUE(MID(M39,2,5)),M39)","v":94},{"$f":"IF(OR(LEFT(N39,1)=\"<\",LEFT(N39,1)=\">\"),VALUE(MID(N39,2,5)),N39)","v":850},{"$f":"IF(OR(LEFT(O39,1)=\"<\",LEFT(O39,1)=\">\"),VALUE(MID(O39,2,5)),O39)","v":87},{"$f":"IF(OR(LEFT(P39,1)=\"<\",LEFT(P39,1)=\">\"),VALUE(MID(P39,2,5)),P39)","v":1700},{"$f":"IF(OR(LEFT(Q39,1)=\"<\",LEFT(Q39,1)=\">\"),VALUE(MID(Q39,2,5)),Q39)","v":""},{"$f":"IF(OR(LEFT(R39,1)=\"<\",LEFT(R39,1)=\">\"),VALUE(MID(R39,2,5)),R39)","v":""},{"$f":"IF(OR(LEFT(S39,1)=\"<\",LEFT(S39,1)=\">\"),VALUE(MID(S39,2,5)),S39)","v":""},{"$f":"IF(OR(LEFT(#REF!,1)=\"<\",LEFT(#REF!,1)=\">\"),VALUE(MID(#REF!,2,5)),#REF!)","v":{"$error":"#REF!"}},{"$f":"IF(OR(LEFT(#REF!,1)=\"<\",LEFT(#REF!,1)=\">\"),VALUE(MID(#REF!,2,5)),#REF!)","v":{"$error":"#REF!"}},{"$f":"IF(OR(LEFT(#REF!,1)=\"<\",LEFT(#REF!,1)=\">\"),VALUE(MID(#REF!,2,5)),#REF!)","v":{"$error":"#REF!"}}]
[9,"18 Sege å, nordväst Valdemarsro, järnvägsbron","2021-08-19","",15.6,6.6,66,7.63,8.6,45.1,"",7,100,830,35,1200,"","","",1140,"",null,null,null,null,null,null,null,null,null,null,null,null,null,"",15.6,6.6,66,7.63,8.6,45.1,"",7,100,830,35,1200,"","","",{"$f":"IF(OR(LEFT(#REF!,1)=\"<\",LEFT(#REF!,1)=\">\"),VALUE(MID(#REF!,2,5)),#REF!)","v":{"$error":"#REF!"}},{"$f":"IF(OR(LEFT(#REF!,1)=\"<\",LEFT(#REF!,1)=\">\"),VALUE(MID(#REF!,2,5)),#REF!)","v":{"$error":"#REF!"}},{"$f":"IF(OR(LEFT(#REF!,1)=\"<\",LEFT(#REF!,1)=\">\"),VALUE(MID(#REF!,2,5)),#REF!)","v":{"$error":"#REF!"}}]
[9,"18 Sege å, nordväst Valdemarsro, järnvägsbron","2021-10-20","",12,8.3000000000000007,77,7.89,8.6999999999999993,59.6,"",7.9,84,1800,50,2600,"","","",1200,"",null,null,null,null,null,null,null,null,null,null,null,null,null,"",12,8.3000000000000007,77,7.89,8.6999999999999993,59.6,"",7.9,84,1800,50,2600,"","","",{"$f":"IF(OR(LEFT(#REF!,1)=\"<\",LEFT(#REF!,1)=\">\"),VALUE(MID(#REF!,2,5)),#REF!)","v":{"$error":"#REF!"}},{"$f":"IF(OR(LEFT(#REF!,1)=\"<\",LEFT(#REF!,1)=\">\"),VALUE(MID(#REF!,2,5)),#REF!)","v":{"$error":"#REF!"}},{"$f":"IF(OR(LEFT(#REF!,1)=\"<\",LEFT(#REF!,1)=\">\"),VALUE(MID(#REF!,2,5)),#REF!)","v":{"$error":"#REF!"}}]
[9,"18 Sege å, nordväst Valdemarsro, järnvägsbron","2021-12-20","",3.4,11.5,86,7.98,11,69.400000000000006,"",14,90,5200,170,5600,"","","",1300,"",null,null,null,null,null,null,null,null,null,null,null,null,null,"",3.4,11.5,86,7.98,11,69.400000000000006,"",14,90,5200,170,5600,"","","",{"$f":"IF(OR(LEFT(#REF!,1)=\"<\",LEFT(#REF!,1)=\">\"),VALUE(MID(#REF!,2,5)),#REF!)","v":{"$error":"#REF!"}},{"$f":"IF(OR(LEFT(#REF!,1)=\"<\",LEFT(#REF!,1)=\">\"),VALUE(MID(#REF!,2,5)),#REF!)","v":{"$error":"#REF!"}},{"$f":"IF(OR(LEFT(#REF!,1)=\"<\",LEFT(#REF!,1)=\">\"),VALUE(MID(#REF!,2,5)),#REF!)","v":{"$error":"#REF!"}}]
[null,null,"Medel",null,9.6333333333333329,9.3333333333333339,78.5,7.8616666666666672,8.85,65.983333333333348,null,11.316666666666668,88.166666666666671,2563.3333333333335,99.333333333333329,3183.3333333333335,null,null,null,null,null,null,null,null,null,null,null,null,null,null,null,null,null,null,0,9.6333333333333329,9.3333333333333339,78.5,7.8616666666666672,8.85,65.983333333333348,0,11.316666666666668,88.166666666666671,2563.3333333333335,99.333333333333329,3183.3333333333335,0,0,0,{"$f":"IF(OR(LEFT(#REF!,1)=\"<\",LEFT(#REF!,1)=\">\"),VALUE(MID(#REF!,2,5)),#REF!)","v":{"$error":"#REF!"}},{"$f":"IF(OR(LEFT(#REF!,1)=\"<\",LEFT(#REF!,1)=\">\"),VALUE(MID(#REF!,2,5)),#REF!)","v":{"$error":"#REF!"}},{"$f":"IF(OR(LEFT(#REF!,1)=\"<\",LEFT(#REF!,1)=\">\"),VALUE(MID(#REF!,2,5)),#REF!)","v":{"$error":"#REF!"}}]
[null,null,"Max",null,17.2,13.5,92,8,14,78.2,null,14,100,5200,240,5600,null,null,null,null,null,null,null,null,null,null,null,null,null,null,null,null,null,null,0,17.2,13.5,92,8,14,78.2,0,14,100,5200,240,5600,0,0,0,{"$f":"IF(OR(LEFT(#REF!,1)=\"<\",LEFT(#REF!,1)=\">\"),VALUE(MID(#REF!,2,5)),#REF!)","v":{"$error":"#REF!"}},{"$f":"IF(OR(LEFT(#REF!,1)=\"<\",LEFT(#REF!,1)=\">\"),VALUE(MID(#REF!,2,5)),#REF!)","v":{"$error":"#REF!"}},{"$f":"IF(OR(LEFT(#REF!,1)=\"<\",LEFT(#REF!,1)=\">\"),VALUE(MID(#REF!,2,5)),#REF!)","v":{"$error":"#REF!"}}]
[null,null,"Min",null,0.1,5.7,59,7.63,4.0999999999999996,45.1,null,7,62,830,14,1200,null,null,null,null,null,null,null,null,null,null,null,null,null,null,null,null,null,null,0,0.1,5.7,59,7.63,4.0999999999999996,45.1,0,7,62,830,14,1200,0,0,0,{"$f":"IF(OR(LEFT(#REF!,1)=\"<\",LEFT(#REF!,1)=\">\"),VALUE(MID(#REF!,2,5)),#REF!)","v":{"$error":"#REF!"}},{"$f":"IF(OR(LEFT(#REF!,1)=\"<\",LEFT(#REF!,1)=\">\"),VALUE(MID(#REF!,2,5)),#REF!)","v":{"$error":"#REF!"}},{"$f":"IF(OR(LEFT(#REF!,1)=\"<\",LEFT(#REF!,1)=\">\"),VALUE(MID(#REF!,2,5)),#REF!)","v":{"$error":"#REF!"}}]
[null,null,null,null,null,null,null,null,null,null,null,null,null,null,null,null,null,null,null,null,null,null,null,null,null,null,null,null,null,null,null,null,null,null,0,0,0,0,0,0,0,0,0,0,0,0,0,0,0,0,{"$f":"IF(OR(LEFT(#REF!,1)=\"<\",LEFT(#REF!,1)=\">\"),VALUE(MID(#REF!,2,5)),#REF!)","v":{"$error":"#REF!"}},{"$f":"IF(OR(LEFT(#REF!,1)=\"<\",LEFT(#REF!,1)=\">\"),VALUE(MID(#REF!,2,5)),#REF!)","v":{"$error":"#REF!"}},{"$f":"IF(OR(LEFT(#REF!,1)=\"<\",LEFT(#REF!,1)=\">\"),VALUE(MID(#REF!,2,5)),#REF!)","v":{"$error":"#REF!"}}]
[11,"21 Spångholmsbäcken, vid utlopp till Sege å","2021-02-15","",0,13.5,92,7.9,11,68.7,"",16,72,1500,640,3100,"","","",1500,"istäckt",null,null,null,null,null,null,null,null,null,null,null,null,null,"",0,13.5,92,7.9,11,68.7,"",16,72,1500,640,3100,"","","",{"$f":"IF(OR(LEFT(#REF!,1)=\"<\",LEFT(#REF!,1)=\">\"),VALUE(MID(#REF!,2,5)),#REF!)","v":{"$error":"#REF!"}},{"$f":"IF(OR(LEFT(#REF!,1)=\"<\",LEFT(#REF!,1)=\">\"),VALUE(MID(#REF!,2,5)),#REF!)","v":{"$error":"#REF!"}},{"$f":"IF(OR(LEFT(#REF!,1)=\"<\",LEFT(#REF!,1)=\">\"),VALUE(MID(#REF!,2,5)),#REF!)","v":{"$error":"#REF!"}}]
[11,"21 Spångholmsbäcken, vid utlopp till Sege å","2021-04-19","",8.6,11,95,7.85,7,63.9,"",15,60,1200,50,2100,"","","",930,"",null,null,null,null,null,null,null,null,null,null,null,null,null,"",8.6,11,95,7.85,7,63.9,"",15,60,1200,50,2100,"","","",{"$f":"IF(OR(LEFT(#REF!,1)=\"<\",LEFT(#REF!,1)=\">\"),VALUE(MID(#REF!,2,5)),#REF!)","v":{"$error":"#REF!"}},{"$f":"IF(OR(LEFT(#REF!,1)=\"<\",LEFT(#REF!,1)=\">\"),VALUE(MID(#REF!,2,5)),#REF!)","v":{"$error":"#REF!"}},{"$f":"IF(OR(LEFT(#REF!,1)=\"<\",LEFT(#REF!,1)=\">\"),VALUE(MID(#REF!,2,5)),#REF!)","v":{"$error":"#REF!"}}]
[11,"21 Spångholmsbäcken, vid utlopp till Sege å","2021-06-15","",14.6,6.2,61,7.7,7.7,77.5,"",8.6,120,1000,91,1700,"","","",900,"",null,null,null,null,null,null,null,null,null,null,null,null,null,"",14.6,6.2,61,7.7,7.7,77.5,"",8.6,120,1000,91,1700,"","","",{"$f":"IF(OR(LEFT(#REF!,1)=\"<\",LEFT(#REF!,1)=\">\"),VALUE(MID(#REF!,2,5)),#REF!)","v":{"$error":"#REF!"}},{"$f":"IF(OR(LEFT(#REF!,1)=\"<\",LEFT(#REF!,1)=\">\"),VALUE(MID(#REF!,2,5)),#REF!)","v":{"$error":"#REF!"}},{"$f":"IF(OR(LEFT(#REF!,1)=\"<\",LEFT(#REF!,1)=\">\"),VALUE(MID(#REF!,2,5)),#REF!)","v":{"$error":"#REF!"}}]
[11,"21 Spångholmsbäcken, vid utlopp till Sege å","2021-08-19","",15,9.5,94,7.7,4.3,59.2,"",7.8,130,1600,86,2100,"","","",1230,"",null,null,null,null,null,null,null,null,null,null,null,null,null,"",15,9.5,94,7.7,4.3,59.2,"",7.8,130,1600,86,2100,"","","",{"$f":"IF(OR(LEFT(#REF!,1)=\"<\",LEFT(#REF!,1)=\">\"),VALUE(MID(#REF!,2,5)),#REF!)","v":{"$error":"#REF!"}},{"$f":"IF(OR(LEFT(#REF!,1)=\"<\",LEFT(#REF!,1)=\">\"),VALUE(MID(#REF!,2,5)),#REF!)","v":{"$error":"#REF!"}},{"$f":"IF(OR(LEFT(#REF!,1)=\"<\",LEFT(#REF!,1)=\">\"),VALUE(MID(#REF!,2,5)),#REF!)","v":{"$error":"#REF!"}}]
[11,"21 Spångholmsbäcken, vid utlopp till Sege å","2021-10-20","",12.4,7.2,68,7.73,4.2,62,"",7.1,66,1500,28,2200,"","","",1300,"",null,null,null,null,null,null,null,null,null,null,null,null,null,"",12.4,7.2,68,7.73,4.2,62,"",7.1,66,1500,28,2200,"","","",{"$f":"IF(OR(LEFT(#REF!,1)=\"<\",LEFT(#REF!,1)=\">\"),VALUE(MID(#REF!,2,5)),#REF!)","v":{"$error":"#REF!"}},{"$f":"IF(OR(LEFT(#REF!,1)=\"<\",LEFT(#REF!,1)=\">\"),VALUE(MID(#REF!,2,5)),#REF!)","v":{"$error":"#REF!"}},{"$f":"IF(OR(LEFT(#REF!,1)=\"<\",LEFT(#REF!,1)=\">\"),VALUE(MID(#REF!,2,5)),#REF!)","v":{"$error":"#REF!"}}]
[11,"21 Spångholmsbäcken, vid utlopp till Sege å","2021-12-20","",2.4,12.1,88,7.94,7.9,58.3,"",16,66,1400,390,2600,"","","",1345,"",null,null,null,null,null,null,null,null,null,null,null,null,null,"",2.4,12.1,88,7.94,7.9,58.3,"",16,66,1400,390,2600,"","","",{"$f":"IF(OR(LEFT(#REF!,1)=\"<\",LEFT(#REF!,1)=\">\"),VALUE(MID(#REF!,2,5)),#REF!)","v":{"$error":"#REF!"}},{"$f":"IF(OR(LEFT(#REF!,1)=\"<\",LEFT(#REF!,1)=\">\"),VALUE(MID(#REF!,2,5)),#REF!)","v":{"$error":"#REF!"}},{"$f":"IF(OR(LEFT(#REF!,1)=\"<\",LEFT(#REF!,1)=\">\"),VALUE(MID(#REF!,2,5)),#REF!)","v":{"$error":"#REF!"}}]
[null,null,"Medel",null,8.8333333333333339,9.9166666666666679,83,7.8033333333333319,7.0166666666666666,64.933333333333337,null,11.75,85.666666666666671,1366.6666666666667,214.16666666666666,2300,null,null,null,null,null,null,null,null,null,null,null,null,null,null,null,null,null,null,0,8.8333333333333339,9.9166666666666679,83,7.8033333333333319,7.0166666666666666,64.933333333333337,0,11.75,85.666666666666671,1366.6666666666667,214.16666666666666,2300,0,0,0,{"$f":"IF(OR(LEFT(#REF!,1)=\"<\",LEFT(#REF!,1)=\">\"),VALUE(MID(#REF!,2,5)),#REF!)","v":{"$error":"#REF!"}},{"$f":"IF(OR(LEFT(#REF!,1)=\"<\",LEFT(#REF!,1)=\">\"),VALUE(MID(#REF!,2,5)),#REF!)","v":{"$error":"#REF!"}},{"$f":"IF(OR(LEFT(#REF!,1)=\"<\",LEFT(#REF!,1)=\">\"),VALUE(MID(#REF!,2,5)),#REF!)","v":{"$error":"#REF!"}}]
[null,null,"Max",null,15,13.5,95,7.94,11,77.5,null,16,130,1600,640,3100,null,null,null,null,null,null,null,null,null,null,null,null,null,null,null,null,null,null,0,15,13.5,95,7.94,11,77.5,0,16,130,1600,640,3100,0,0,0,{"$f":"IF(OR(LEFT(#REF!,1)=\"<\",LEFT(#REF!,1)=\">\"),VALUE(MID(#REF!,2,5)),#REF!)","v":{"$error":"#REF!"}},{"$f":"IF(OR(LEFT(#REF!,1)=\"<\",LEFT(#REF!,1)=\">\"),VALUE(MID(#REF!,2,5)),#REF!)","v":{"$error":"#REF!"}},{"$f":"IF(OR(LEFT(#REF!,1)=\"<\",LEFT(#REF!,1)=\">\"),VALUE(MID(#REF!,2,5)),#REF!)","v":{"$error":"#REF!"}}]
[null,null,"Min",null,0,6.2,61,7.7,4.2,58.3,null,7.1,60,1000,28,1700,null,null,null,null,null,null,null,null,null,null,null,null,null,null,null,null,null,null,0,0,6.2,61,7.7,4.2,58.3,0,7.1,60,1000,28,1700,0,0,0,{"$f":"IF(OR(LEFT(#REF!,1)=\"<\",LEFT(#REF!,1)=\">\"),VALUE(MID(#REF!,2,5)),#REF!)","v":{"$error":"#REF!"}},{"$f":"IF(OR(LEFT(#REF!,1)=\"<\",LEFT(#REF!,1)=\">\"),VALUE(MID(#REF!,2,5)),#REF!)","v":{"$error":"#REF!"}},{"$f":"IF(OR(LEFT(#REF!,1)=\"<\",LEFT(#REF!,1)=\">\"),VALUE(MID(#REF!,2,5)),#REF!)","v":{"$error":"#REF!"}}]
[null,null,null,null,null,null,null,null,null,null,null,null,null,null,null,null,null,null,null,null,null,null,null,null,null,null,null,null,null,null,null,null,null,null,0,0,0,0,0,0,0,0,0,0,0,0,0,0,0,0,{"$f":"IF(OR(LEFT(#REF!,1)=\"<\",LEFT(#REF!,1)=\">\"),VALUE(MID(#REF!,2,5)),#REF!)","v":{"$error":"#REF!"}},{"$f":"IF(OR(LEFT(#REF!,1)=\"<\",LEFT(#REF!,1)=\">\"),VALUE(MID(#REF!,2,5)),#REF!)","v":{"$error":"#REF!"}},{"$f":"IF(OR(LEFT(#REF!,1)=\"<\",LEFT(#REF!,1)=\">\"),VALUE(MID(#REF!,2,5)),#REF!)","v":{"$error":"#REF!"}}]
[13,"22b Spångholmsbäcken, bron vid Torupsvägen","2021-02-15","",0.1,13.8,95,7.91,6.6,62.9,"",18,55,1400,910,3000,"","","",1510,"is i kanten ",null,null,null,null,null,null,null,null,null,null,null,null,null,"",0.1,13.8,95,7.91,6.6,62.9,"",18,55,1400,910,3000,"","","",{"$f":"IF(OR(LEFT(#REF!,1)=\"<\",LEFT(#REF!,1)=\">\"),VALUE(MID(#REF!,2,5)),#REF!)","v":{"$error":"#REF!"}},{"$f":"IF(OR(LEFT(#REF!,1)=\"<\",LEFT(#REF!,1)=\">\"),VALUE(MID(#REF!,2,5)),#REF!)","v":{"$error":"#REF!"}},{"$f":"IF(OR(LEFT(#REF!,1)=\"<\",LEFT(#REF!,1)=\">\"),VALUE(MID(#REF!,2,5)),#REF!)","v":{"$error":"#REF!"}}]
[13,"22b Spångholmsbäcken, bron vid Torupsvägen","2021-04-19","",9.1,11.5,100,7.83,4.3,58.8,"",18,52,1200,180,2300,"","","",950,"",null,null,null,null,null,null,null,null,null,null,null,null,null,"",9.1,11.5,100,7.83,4.3,58.8,"",18,52,1200,180,2300,"","","",{"$f":"IF(OR(LEFT(#REF!,1)=\"<\",LEFT(#REF!,1)=\">\"),VALUE(MID(#REF!,2,5)),#REF!)","v":{"$error":"#REF!"}},{"$f":"IF(OR(LEFT(#REF!,1)=\"<\",LEFT(#REF!,1)=\">\"),VALUE(MID(#REF!,2,5)),#REF!)","v":{"$error":"#REF!"}},{"$f":"IF(OR(LEFT(#REF!,1)=\"<\",LEFT(#REF!,1)=\">\"),VALUE(MID(#REF!,2,5)),#REF!)","v":{"$error":"#REF!"}}]
[13,"22b Spångholmsbäcken, bron vid Torupsvägen","2021-06-15","",14.5,5.4,53,7.68,5.8,74.8,"",11,76,1900,130,4100,"","","",920,"",null,null,null,null,null,null,null,null,null,null,null,null,null,"",14.5,5.4,53,7.68,5.8,74.8,"",11,76,1900,130,4100,"","","",{"$f":"IF(OR(LEFT(#REF!,1)=\"<\",LEFT(#REF!,1)=\">\"),VALUE(MID(#REF!,2,5)),#REF!)","v":{"$error":"#REF!"}},{"$f":"IF(OR(LEFT(#REF!,1)=\"<\",LEFT(#REF!,1)=\">\"),VALUE(MID(#REF!,2,5)),#REF!)","v":{"$error":"#REF!"}},{"$f":"IF(OR(LEFT(#REF!,1)=\"<\",LEFT(#REF!,1)=\">\"),VALUE(MID(#REF!,2,5)),#REF!)","v":{"$error":"#REF!"}}]
[13,"22b Spångholmsbäcken, bron vid Torupsvägen","2021-08-19","",14.4,5.7,56,7.66,3.4,73.5,"",9.6999999999999993,68,4500,40,5200,"","","",1240,"",null,null,null,null,null,null,null,null,null,null,null,null,null,"",14.4,5.7,56,7.66,3.4,73.5,"",9.6999999999999993,68,4500,40,5200,"","","",{"$f":"IF(OR(LEFT(#REF!,1)=\"<\",LEFT(#REF!,1)=\">\"),VALUE(MID(#REF!,2,5)),#REF!)","v":{"$error":"#REF!"}},{"$f":"IF(OR(LEFT(#REF!,1)=\"<\",LEFT(#REF!,1)=\">\"),VALUE(MID(#REF!,2,5)),#REF!)","v":{"$error":"#REF!"}},{"$f":"IF(OR(LEFT(#REF!,1)=\"<\",LEFT(#REF!,1)=\">\"),VALUE(MID(#REF!,2,5)),#REF!)","v":{"$error":"#REF!"}}]
[13,"22b Spångholmsbäcken, bron vid Torupsvägen","2021-10-20","",12.4,7.8,73,7.63,3.9,80.099999999999994,"",13,64,5100,15,6400,"","","",1315,"",null,null,null,null,null,null,null,null,null,null,null,null,null,"",12.4,7.8,73,7.63,3.9,80.099999999999994,"",13,64,5100,15,6400,"","","",{"$f":"IF(OR(LEFT(#REF!,1)=\"<\",LEFT(#REF!,1)=\">\"),VALUE(MID(#REF!,2,5)),#REF!)","v":{"$error":"#REF!"}},{"$f":"IF(OR(LEFT(#REF!,1)=\"<\",LEFT(#REF!,1)=\">\"),VALUE(MID(#REF!,2,5)),#REF!)","v":{"$error":"#REF!"}},{"$f":"IF(OR(LEFT(#REF!,1)=\"<\",LEFT(#REF!,1)=\">\"),VALUE(MID(#REF!,2,5)),#REF!)","v":{"$error":"#REF!"}}]
[13,"22b Spångholmsbäcken, bron vid Torupsvägen","2021-12-20","",2,12.5,90,7.94,6.3,54.5,"",17,64,920,520,3000,"","","",1355,"",null,null,null,null,null,null,null,null,null,null,null,null,null,"",2,12.5,90,7.94,6.3,54.5,"",17,64,920,520,3000,"","","",{"$f":"IF(OR(LEFT(#REF!,1)=\"<\",LEFT(#REF!,1)=\">\"),VALUE(MID(#REF!,2,5)),#REF!)","v":{"$error":"#REF!"}},{"$f":"IF(OR(LEFT(#REF!,1)=\"<\",LEFT(#REF!,1)=\">\"),VALUE(MID(#REF!,2,5)),#REF!)","v":{"$error":"#REF!"}},{"$f":"IF(OR(LEFT(#REF!,1)=\"<\",LEFT(#REF!,1)=\">\"),VALUE(MID(#REF!,2,5)),#REF!)","v":{"$error":"#REF!"}}]
[null,null,"Medel",null,8.75,9.4500000000000011,77.833333333333329,7.7749999999999995,5.05,67.433333333333337,null,14.450000000000001,63.166666666666664,2503.3333333333335,299.16666666666669,4000,null,null,null,null,null,null,null,null,null,null,null,null,null,null,null,null,null,null,0,8.75,9.4500000000000011,77.833333333333329,7.7749999999999995,5.05,67.433333333333337,0,14.450000000000001,63.166666666666664,2503.3333333333335,299.16666666666669,4000,0,0,0,{"$f":"IF(OR(LEFT(#REF!,1)=\"<\",LEFT(#REF!,1)=\">\"),VALUE(MID(#REF!,2,5)),#REF!)","v":{"$error":"#REF!"}},{"$f":"IF(OR(LEFT(#REF!,1)=\"<\",LEFT(#REF!,1)=\">\"),VALUE(MID(#REF!,2,5)),#REF!)","v":{"$error":"#REF!"}},{"$f":"IF(OR(LEFT(#REF!,1)=\"<\",LEFT(#REF!,1)=\">\"),VALUE(MID(#REF!,2,5)),#REF!)","v":{"$error":"#REF!"}}]
[null,null,"Max",null,14.5,13.8,100,7.94,6.6,80.099999999999994,null,18,76,5100,910,6400,null,null,null,null,null,null,null,null,null,null,null,null,null,null,null,null,null,null,0,14.5,13.8,100,7.94,6.6,80.099999999999994,0,18,76,5100,910,6400,0,0,0,{"$f":"IF(OR(LEFT(#REF!,1)=\"<\",LEFT(#REF!,1)=\">\"),VALUE(MID(#REF!,2,5)),#REF!)","v":{"$error":"#REF!"}},{"$f":"IF(OR(LEFT(#REF!,1)=\"<\",LEFT(#REF!,1)=\">\"),VALUE(MID(#REF!,2,5)),#REF!)","v":{"$error":"#REF!"}},{"$f":"IF(OR(LEFT(#REF!,1)=\"<\",LEFT(#REF!,1)=\">\"),VALUE(MID(#REF!,2,5)),#REF!)","v":{"$error":"#REF!"}}]
[null,null,"Min",null,0.1,5.4,53,7.63,3.4,54.5,null,9.6999999999999993,52,920,15,2300,null,null,null,null,null,null,null,null,null,null,null,null,null,null,null,null,null,null,0,0.1,5.4,53,7.63,3.4,54.5,0,9.6999999999999993,52,920,15,2300,0,0,0,{"$f":"IF(OR(LEFT(#REF!,1)=\"<\",LEFT(#REF!,1)=\">\"),VALUE(MID(#REF!,2,5)),#REF!)","v":{"$error":"#REF!"}},{"$f":"IF(OR(LEFT(#REF!,1)=\"<\",LEFT(#REF!,1)=\">\"),VALUE(MID(#REF!,2,5)),#REF!)","v":{"$error":"#REF!"}},{"$f":"IF(OR(LEFT(#REF!,1)=\"<\",LEFT(#REF!,1)=\">\"),VALUE(MID(#REF!,2,5)),#REF!)","v":{"$error":"#REF!"}}]
[null,null,null,null,null,null,null,null,null,null,null,null,null,null,null,null,null,null,null,null,null,null,null,null,null,null,null,null,null,null,null,null,null,null,0,0,0,0,0,0,0,0,0,0,0,0,0,0,0,0,{"$f":"IF(OR(LEFT(#REF!,1)=\"<\",LEFT(#REF!,1)=\">\"),VALUE(MID(#REF!,2,5)),#REF!)","v":{"$error":"#REF!"}},{"$f":"IF(OR(LEFT(#REF!,1)=\"<\",LEFT(#REF!,1)=\">\"),VALUE(MID(#REF!,2,5)),#REF!)","v":{"$error":"#REF!"}},{"$f":"IF(OR(LEFT(#REF!,1)=\"<\",LEFT(#REF!,1)=\">\"),VALUE(MID(#REF!,2,5)),#REF!)","v":{"$error":"#REF!"}}]
[15,"23 Spångholmsbäcken, uppströms Torupsdammen","2021-02-15","",0,14.3,98,8.01,10,59,"",18,62,760,980,3000,"","","",1520,"istäckt",null,null,null,null,null,null,null,null,null,null,null,null,null,"",0,14.3,98,8.01,10,59,"",18,62,760,980,3000,"","","",{"$f":"IF(OR(LEFT(#REF!,1)=\"<\",LEFT(#REF!,1)=\">\"),VALUE(MID(#REF!,2,5)),#REF!)","v":{"$error":"#REF!"}},{"$f":"IF(OR(LEFT(#REF!,1)=\"<\",LEFT(#REF!,1)=\">\"),VALUE(MID(#REF!,2,5)),#REF!)","v":{"$error":"#REF!"}},{"$f":"IF(OR(LEFT(#REF!,1)=\"<\",LEFT(#REF!,1)=\">\"),VALUE(MID(#REF!,2,5)),#REF!)","v":{"$error":"#REF!"}}]
[15,"23 Spångholmsbäcken, uppströms Torupsdammen","2021-04-19","",9.4,11.1,97,7.99,3.1,56.4,"",18,53,590,410,2100,"","","",1010,"",null,null,null,null,null,null,null,null,null,null,null,null,null,"",9.4,11.1,97,7.99,3.1,56.4,"",18,53,590,410,2100,"","","",{"$f":"IF(OR(LEFT(#REF!,1)=\"<\",LEFT(#REF!,1)=\">\"),VALUE(MID(#REF!,2,5)),#REF!)","v":{"$error":"#REF!"}},{"$f":"IF(OR(LEFT(#REF!,1)=\"<\",LEFT(#REF!,1)=\">\"),VALUE(MID(#REF!,2,5)),#REF!)","v":{"$error":"#REF!"}},{"$f":"IF(OR(LEFT(#REF!,1)=\"<\",LEFT(#REF!,1)=\">\"),VALUE(MID(#REF!,2,5)),#REF!)","v":{"$error":"#REF!"}}]
[15,"23 Spångholmsbäcken, uppströms Torupsdammen","2021-06-15","",14.6,3.9,38,7.58,5.3,65,"",15,220,45,570,1700,"","","",940,"",null,null,null,null,null,null,null,null,null,null,null,null,null,"",14.6,3.9,38,7.58,5.3,65,"",15,220,45,570,1700,"","","",{"$f":"IF(OR(LEFT(#REF!,1)=\"<\",LEFT(#REF!,1)=\">\"),VALUE(MID(#REF!,2,5)),#REF!)","v":{"$error":"#REF!"}},{"$f":"IF(OR(LEFT(#REF!,1)=\"<\",LEFT(#REF!,1)=\">\"),VALUE(MID(#REF!,2,5)),#REF!)","v":{"$error":"#REF!"}},{"$f":"IF(OR(LEFT(#REF!,1)=\"<\",LEFT(#REF!,1)=\">\"),VALUE(MID(#REF!,2,5)),#REF!)","v":{"$error":"#REF!"}}]
[15,"23 Spångholmsbäcken, uppströms Torupsdammen","2021-08-19","",15.6,7.1,72,7.77,12,60.9,"",7.1,110,2900,31,3500,"","","",1250,"",null,null,null,null,null,null,null,null,null,null,null,null,null,"",15.6,7.1,72,7.77,12,60.9,"",7.1,110,2900,31,3500,"","","",{"$f":"IF(OR(LEFT(#REF!,1)=\"<\",LEFT(#REF!,1)=\">\"),VALUE(MID(#REF!,2,5)),#REF!)","v":{"$error":"#REF!"}},{"$f":"IF(OR(LEFT(#REF!,1)=\"<\",LEFT(#REF!,1)=\">\"),VALUE(MID(#REF!,2,5)),#REF!)","v":{"$error":"#REF!"}},{"$f":"IF(OR(LEFT(#REF!,1)=\"<\",LEFT(#REF!,1)=\">\"),VALUE(MID(#REF!,2,5)),#REF!)","v":{"$error":"#REF!"}}]
[15,"23 Spångholmsbäcken, uppströms Torupsdammen","2021-10-20","",12.8,7.6,72,7.51,1.5,70.099999999999994,"",17,94,360,45,1600,"","","",1330,"",null,null,null,null,null,null,null,null,null,null,null,null,null,"",12.8,7.6,72,7.51,1.5,70.099999999999994,{"$f":"IF(OR(LEFT(K71,1)=\"<\",LEFT(K71,1)=\">\"),VALUE(MID(K71,2,5)),K71)","v":""},{"$f":"IF(OR(LEFT(L71,1)=\"<\",LEFT(L71,1)=\">\"),VALUE(MID(L71,2,5)),L71)","v":17},{"$f":"IF(OR(LEFT(M71,1)=\"<\",LEFT(M71,1)=\">\"),VALUE(MID(M71,2,5)),M71)","v":94},{"$f":"IF(OR(LEFT(N71,1)=\"<\",LEFT(N71,1)=\">\"),VALUE(MID(N71,2,5)),N71)","v":360},{"$f":"IF(OR(LEFT(O71,1)=\"<\",LEFT(O71,1)=\">\"),VALUE(MID(O71,2,5)),O71)","v":45},{"$f":"IF(OR(LEFT(P71,1)=\"<\",LEFT(P71,1)=\">\"),VALUE(MID(P71,2,5)),P71)","v":1600},{"$f":"IF(OR(LEFT(Q71,1)=\"<\",LEFT(Q71,1)=\">\"),VALUE(MID(Q71,2,5)),Q71)","v":""},{"$f":"IF(OR(LEFT(R71,1)=\"<\",LEFT(R71,1)=\">\"),VALUE(MID(R71,2,5)),R71)","v":""},{"$f":"IF(OR(LEFT(S71,1)=\"<\",LEFT(S71,1)=\">\"),VALUE(MID(S71,2,5)),S71)","v":""},{"$f":"IF(OR(LEFT(#REF!,1)=\"<\",LEFT(#REF!,1)=\">\"),VALUE(MID(#REF!,2,5)),#REF!)","v":{"$error":"#REF!"}},{"$f":"IF(OR(LEFT(#REF!,1)=\"<\",LEFT(#REF!,1)=\">\"),VALUE(MID(#REF!,2,5)),#REF!)","v":{"$error":"#REF!"}},{"$f":"IF(OR(LEFT(#REF!,1)=\"<\",LEFT(#REF!,1)=\">\"),VALUE(MID(#REF!,2,5)),#REF!)","v":{"$error":"#REF!"}}]
[15,"23 Spångholmsbäcken, uppströms Torupsdammen","2021-12-20","",1.9,12.2,88,8.19,7.3,52.2,"",19,66,310,540,2000,"","","",1410,"",null,null,null,null,null,null,null,null,null,null,null,null,null,"",1.9,12.2,88,8.19,7.3,52.2,"",19,66,310,540,2000,"","","",{"$f":"IF(OR(LEFT(#REF!,1)=\"<\",LEFT(#REF!,1)=\">\"),VALUE(MID(#REF!,2,5)),#REF!)","v":{"$error":"#REF!"}},{"$f":"IF(OR(LEFT(#REF!,1)=\"<\",LEFT(#REF!,1)=\">\"),VALUE(MID(#REF!,2,5)),#REF!)","v":{"$error":"#REF!"}},{"$f":"IF(OR(LEFT(#REF!,1)=\"<\",LEFT(#REF!,1)=\">\"),VALUE(MID(#REF!,2,5)),#REF!)","v":{"$error":"#REF!"}}]
[null,null,"Medel",null,9.0500000000000007,9.3666666666666671,77.5,7.8416666666666659,6.5333333333333323,60.599999999999994,null,15.683333333333332,100.83333333333333,827.5,429.33333333333331,2316.6666666666665,null,null,null,null,null,null,null,null,null,null,null,null,null,null,null,null,null,null,0,9.0500000000000007,9.3666666666666671,77.5,7.8416666666666659,6.5333333333333323,60.599999999999994,0,15.683333333333332,100.83333333333333,827.5,429.33333333333331,2316.6666666666665,0,0,0,{"$f":"IF(OR(LEFT(#REF!,1)=\"<\",LEFT(#REF!,1)=\">\"),VALUE(MID(#REF!,2,5)),#REF!)","v":{"$error":"#REF!"}},{"$f":"IF(OR(LEFT(#REF!,1)=\"<\",LEFT(#REF!,1)=\">\"),VALUE(MID(#REF!,2,5)),#REF!)","v":{"$error":"#REF!"}},{"$f":"IF(OR(LEFT(#REF!,1)=\"<\",LEFT(#REF!,1)=\">\"),VALUE(MID(#REF!,2,5)),#REF!)","v":{"$error":"#REF!"}}]
[null,null,"Max",null,15.6,14.3,98,8.19,12,70.099999999999994,null,19,220,2900,980,3500,null,null,null,null,null,null,null,null,null,null,null,null,null,null,null,null,null,null,0,15.6,14.3,98,8.19,12,70.099999999999994,0,19,220,2900,980,3500,0,0,0,{"$f":"IF(OR(LEFT(#REF!,1)=\"<\",LEFT(#REF!,1)=\">\"),VALUE(MID(#REF!,2,5)),#REF!)","v":{"$error":"#REF!"}},{"$f":"IF(OR(LEFT(#REF!,1)=\"<\",LEFT(#REF!,1)=\">\"),VALUE(MID(#REF!,2,5)),#REF!)","v":{"$error":"#REF!"}},{"$f":"IF(OR(LEFT(#REF!,1)=\"<\",LEFT(#REF!,1)=\">\"),VALUE(MID(#REF!,2,5)),#REF!)","v":{"$error":"#REF!"}}]
[null,null,"Min",null,0,3.9,38,7.51,1.5,52.2,null,7.1,53,45,31,1600,null,null,null,null,null,null,null,null,null,null,null,null,null,null,null,null,null,null,0,0,3.9,38,7.51,1.5,52.2,0,7.1,53,45,31,1600,0,0,0,{"$f":"IF(OR(LEFT(#REF!,1)=\"<\",LEFT(#REF!,1)=\">\"),VALUE(MID(#REF!,2,5)),#REF!)","v":{"$error":"#REF!"}},{"$f":"IF(OR(LEFT(#REF!,1)=\"<\",LEFT(#REF!,1)=\">\"),VALUE(MID(#REF!,2,5)),#REF!)","v":{"$error":"#REF!"}},{"$f":"IF(OR(LEFT(#REF!,1)=\"<\",LEFT(#REF!,1)=\">\"),VALUE(MID(#REF!,2,5)),#REF!)","v":{"$error":"#REF!"}}]
[null,null,null,null,null,null,null,null,null,null,null,null,null,null,null,null,null,null,null,null,null,null,null,null,null,null,null,null,null,null,null,null,null,null,0,0,0,0,0,0,0,0,0,0,0,0,0,0,0,0,{"$f":"IF(OR(LEFT(#REF!,1)=\"<\",LEFT(#REF!,1)=\">\"),VALUE(MID(#REF!,2,5)),#REF!)","v":{"$error":"#REF!"}},{"$f":"IF(OR(LEFT(#REF!,1)=\"<\",LEFT(#REF!,1)=\">\"),VALUE(MID(#REF!,2,5)),#REF!)","v":{"$error":"#REF!"}},{"$f":"IF(OR(LEFT(#REF!,1)=\"<\",LEFT(#REF!,1)=\">\"),VALUE(MID(#REF!,2,5)),#REF!)","v":{"$error":"#REF!"}}]
[17,"10 Torrebergabäcken, vägbron nordost Mölleberga","2021-02-15","",0,11.5,79,7.67,9.6,78.900000000000006,"",12,140,6900,210,6700,"","","",1430,"istäckt",null,null,null,null,null,null,null,null,null,null,null,null,null,"",0,11.5,79,7.67,9.6,78.900000000000006,"",12,140,6900,210,6700,"","","",{"$f":"IF(OR(LEFT(#REF!,1)=\"<\",LEFT(#REF!,1)=\">\"),VALUE(MID(#REF!,2,5)),#REF!)","v":{"$error":"#REF!"}},{"$f":"IF(OR(LEFT(#REF!,1)=\"<\",LEFT(#REF!,1)=\">\"),VALUE(MID(#REF!,2,5)),#REF!)","v":{"$error":"#REF!"}},{"$f":"IF(OR(LEFT(#REF!,1)=\"<\",LEFT(#REF!,1)=\">\"),VALUE(MID(#REF!,2,5)),#REF!)","v":{"$error":"#REF!"}}]
[17,"10 Torrebergabäcken, vägbron nordost Mölleberga","2021-04-19","",8.9,9.8000000000000007,85,7.84,5.3,66,"",14,66,2900,20,3600,"","","",910,"",null,null,null,null,null,null,null,null,null,null,null,null,null,"",8.9,9.8000000000000007,85,7.84,5.3,66,"",14,66,2900,20,3600,"","","",{"$f":"IF(OR(LEFT(#REF!,1)=\"<\",LEFT(#REF!,1)=\">\"),VALUE(MID(#REF!,2,5)),#REF!)","v":{"$error":"#REF!"}},{"$f":"IF(OR(LEFT(#REF!,1)=\"<\",LEFT(#REF!,1)=\">\"),VALUE(MID(#REF!,2,5)),#REF!)","v":{"$error":"#REF!"}},{"$f":"IF(OR(LEFT(#REF!,1)=\"<\",LEFT(#REF!,1)=\">\"),VALUE(MID(#REF!,2,5)),#REF!)","v":{"$error":"#REF!"}}]
[17,"10 Torrebergabäcken, vägbron nordost Mölleberga","2021-06-15","",17.100000000000001,3.4,35,7.52,11,64.8,"",12,150,750,100,1700,"","","",830,"",null,null,null,null,null,null,null,null,null,null,null,null,null,"",17.100000000000001,3.4,35,7.52,11,64.8,"",12,150,750,100,1700,"","","",{"$f":"IF(OR(LEFT(#REF!,1)=\"<\",LEFT(#REF!,1)=\">\"),VALUE(MID(#REF!,2,5)),#REF!)","v":{"$error":"#REF!"}},{"$f":"IF(OR(LEFT(#REF!,1)=\"<\",LEFT(#REF!,1)=\">\"),VALUE(MID(#REF!,2,5)),#REF!)","v":{"$error":"#REF!"}},{"$f":"IF(OR(LEFT(#REF!,1)=\"<\",LEFT(#REF!,1)=\">\"),VALUE(MID(#REF!,2,5)),#REF!)","v":{"$error":"#REF!"}}]
[17,"10 Torrebergabäcken, vägbron nordost Mölleberga","2021-08-19","",15.6,3.9,39,7.56,5.6,28.3,"",6.5,140,390,36,890,"","","",1210,"",null,null,null,null,null,null,null,null,null,null,null,null,null,"",15.6,3.9,39,7.56,5.6,28.3,"",6.5,140,390,36,890,"","","",{"$f":"IF(OR(LEFT(#REF!,1)=\"<\",LEFT(#REF!,1)=\">\"),VALUE(MID(#REF!,2,5)),#REF!)","v":{"$error":"#REF!"}},{"$f":"IF(OR(LEFT(#REF!,1)=\"<\",LEFT(#REF!,1)=\">\"),VALUE(MID(#REF!,2,5)),#REF!)","v":{"$error":"#REF!"}},{"$f":"IF(OR(LEFT(#REF!,1)=\"<\",LEFT(#REF!,1)=\">\"),VALUE(MID(#REF!,2,5)),#REF!)","v":{"$error":"#REF!"}}]
[17,"10 Torrebergabäcken, vägbron nordost Mölleberga","2021-10-20","",11.5,5.7,52,7.65,5.2,71.3,"",13,98,2400,59,3200,"","","",1245,"",null,null,null,null,null,null,null,null,null,null,null,null,null,"",11.5,5.7,52,7.65,5.2,71.3,"",13,98,2400,59,3200,"","","",{"$f":"IF(OR(LEFT(#REF!,1)=\"<\",LEFT(#REF!,1)=\">\"),VALUE(MID(#REF!,2,5)),#REF!)","v":{"$error":"#REF!"}},{"$f":"IF(OR(LEFT(#REF!,1)=\"<\",LEFT(#REF!,1)=\">\"),VALUE(MID(#REF!,2,5)),#REF!)","v":{"$error":"#REF!"}},{"$f":"IF(OR(LEFT(#REF!,1)=\"<\",LEFT(#REF!,1)=\">\"),VALUE(MID(#REF!,2,5)),#REF!)","v":{"$error":"#REF!"}}]
[17,"10 Torrebergabäcken, vägbron nordost Mölleberga","2021-12-20","",2.6,10,74,7.81,7,70.8,"",16,85,7700,160,7300,"","","",1315,"",null,null,null,null,null,null,null,null,null,null,null,null,null,"",2.6,10,74,7.81,7,70.8,"",16,85,7700,160,7300,"","","",{"$f":"IF(OR(LEFT(#REF!,1)=\"<\",LEFT(#REF!,1)=\">\"),VALUE(MID(#REF!,2,5)),#REF!)","v":{"$error":"#REF!"}},{"$f":"IF(OR(LEFT(#REF!,1)=\"<\",LEFT(#REF!,1)=\">\"),VALUE(MID(#REF!,2,5)),#REF!)","v":{"$error":"#REF!"}},{"$f":"IF(OR(LEFT(#REF!,1)=\"<\",LEFT(#REF!,1)=\">\"),VALUE(MID(#REF!,2,5)),#REF!)","v":{"$error":"#REF!"}}]
[null,null,"Medel",null,9.2833333333333332,7.3833333333333329,60.666666666666664,7.6750000000000007,7.2833333333333341,63.35,null,12.25,113.16666666666667,3506.6666666666665,97.5,3898.3333333333335,null,null,null,null,null,null,null,null,null,null,null,null,null,null,null,null,null,null,0,9.2833333333333332,7.3833333333333329,60.666666666666664,7.6750000000000007,7.2833333333333341,63.35,0,12.25,113.16666666666667,3506.6666666666665,97.5,3898.3333333333335,0,0,0,{"$f":"IF(OR(LEFT(#REF!,1)=\"<\",LEFT(#REF!,1)=\">\"),VALUE(MID(#REF!,2,5)),#REF!)","v":{"$error":"#REF!"}},{"$f":"IF(OR(LEFT(#REF!,1)=\"<\",LEFT(#REF!,1)=\">\"),VALUE(MID(#REF!,2,5)),#REF!)","v":{"$error":"#REF!"}},{"$f":"IF(OR(LEFT(#REF!,1)=\"<\",LEFT(#REF!,1)=\">\"),VALUE(MID(#REF!,2,5)),#REF!)","v":{"$error":"#REF!"}}]
[null,null,"Max",null,17.100000000000001,11.5,85,7.84,11,78.900000000000006,null,16,150,7700,210,7300,null,null,null,null,null,null,null,null,null,null,null,null,null,null,null,null,null,null,0,17.100000000000001,11.5,85,7.84,11,78.900000000000006,0,16,150,7700,210,7300,0,0,0,{"$f":"IF(OR(LEFT(#REF!,1)=\"<\",LEFT(#REF!,1)=\">\"),VALUE(MID(#REF!,2,5)),#REF!)","v":{"$error":"#REF!"}},{"$f":"IF(OR(LEFT(#REF!,1)=\"<\",LEFT(#REF!,1)=\">\"),VALUE(MID(#REF!,2,5)),#REF!)","v":{"$error":"#REF!"}},{"$f":"IF(OR(LEFT(#REF!,1)=\"<\",LEFT(#REF!,1)=\">\"),VALUE(MID(#REF!,2,5)),#REF!)","v":{"$error":"#REF!"}}]
[null,null,"Min",null,0,3.4,35,7.52,5.2,28.3,null,6.5,66,390,20,890,null,null,null,null,null,null,null,null,null,null,null,null,null,null,null,null,null,null,0,0,3.4,35,7.52,5.2,28.3,0,6.5,66,390,20,890,0,0,0,{"$f":"IF(OR(LEFT(#REF!,1)=\"<\",LEFT(#REF!,1)=\">\"),VALUE(MID(#REF!,2,5)),#REF!)","v":{"$error":"#REF!"}},{"$f":"IF(OR(LEFT(#REF!,1)=\"<\",LEFT(#REF!,1)=\">\"),VALUE(MID(#REF!,2,5)),#REF!)","v":{"$error":"#REF!"}},{"$f":"IF(OR(LEFT(#REF!,1)=\"<\",LEFT(#REF!,1)=\">\"),VALUE(MID(#REF!,2,5)),#REF!)","v":{"$error":"#REF!"}}]
[null,null,null,null,null,null,null,null,null,null,null,null,null,null,null,null,null,null,null,null,null,null,null,null,null,null,null,null,null,null,null,null,null,null,0,0,0,0,0,0,0,0,0,0,0,0,0,0,0,0,{"$f":"IF(OR(LEFT(#REF!,1)=\"<\",LEFT(#REF!,1)=\">\"),VALUE(MID(#REF!,2,5)),#REF!)","v":{"$error":"#REF!"}},{"$f":"IF(OR(LEFT(#REF!,1)=\"<\",LEFT(#REF!,1)=\">\"),VALUE(MID(#REF!,2,5)),#REF!)","v":{"$error":"#REF!"}},{"$f":"IF(OR(LEFT(#REF!,1)=\"<\",LEFT(#REF!,1)=\">\"),VALUE(MID(#REF!,2,5)),#REF!)","v":{"$error":"#REF!"}}]
[18,"15 Risebergabäcken, ca 250 m uppströms från Sege å","2021-02-15","",0.9,14.5,102,8.24,2.6,115,"",5.2,31,1600,37,3600,"","","",1410,"",null,null,null,null,null,null,null,null,null,null,null,null,null,"",0.9,14.5,102,8.24,2.6,115,"",5.2,31,1600,37,3600,"","","",{"$f":"IF(OR(LEFT(#REF!,1)=\"<\",LEFT(#REF!,1)=\">\"),VALUE(MID(#REF!,2,5)),#REF!)","v":{"$error":"#REF!"}},{"$f":"IF(OR(LEFT(#REF!,1)=\"<\",LEFT(#REF!,1)=\">\"),VALUE(MID(#REF!,2,5)),#REF!)","v":{"$error":"#REF!"}},{"$f":"IF(OR(LEFT(#REF!,1)=\"<\",LEFT(#REF!,1)=\">\"),VALUE(MID(#REF!,2,5)),#REF!)","v":{"$error":"#REF!"}}]
[18,"15 Risebergabäcken, ca 250 m uppströms från Sege å","2021-04-19","",9.5,12.2,107,8.06,3.2,104,"",5.5,32,2000,37,2300,"","","",850,"",null,null,null,null,null,null,null,null,null,null,null,null,null,"",9.5,12.2,107,8.06,3.2,104,"",5.5,32,2000,37,2300,"","","",{"$f":"IF(OR(LEFT(#REF!,1)=\"<\",LEFT(#REF!,1)=\">\"),VALUE(MID(#REF!,2,5)),#REF!)","v":{"$error":"#REF!"}},{"$f":"IF(OR(LEFT(#REF!,1)=\"<\",LEFT(#REF!,1)=\">\"),VALUE(MID(#REF!,2,5)),#REF!)","v":{"$error":"#REF!"}},{"$f":"IF(OR(LEFT(#REF!,1)=\"<\",LEFT(#REF!,1)=\">\"),VALUE(MID(#REF!,2,5)),#REF!)","v":{"$error":"#REF!"}}]
[18,"15 Risebergabäcken, ca 250 m uppströms från Sege å","2021-06-15","",13.8,8.5,82,8,5.5,111,"",4.0999999999999996,63,1100,140,1600,"","","",820,"",null,null,null,null,null,null,null,null,null,null,null,null,null,"",13.8,8.5,82,8,5.5,111,"",4.0999999999999996,63,1100,140,1600,"","","",{"$f":"IF(OR(LEFT(#REF!,1)=\"<\",LEFT(#REF!,1)=\">\"),VALUE(MID(#REF!,2,5)),#REF!)","v":{"$error":"#REF!"}},{"$f":"IF(OR(LEFT(#REF!,1)=\"<\",LEFT(#REF!,1)=\">\"),VALUE(MID(#REF!,2,5)),#REF!)","v":{"$error":"#REF!"}},{"$f":"IF(OR(LEFT(#REF!,1)=\"<\",LEFT(#REF!,1)=\">\"),VALUE(MID(#REF!,2,5)),#REF!)","v":{"$error":"#REF!"}}]
[18,"15 Risebergabäcken, ca 250 m uppströms från Sege å","2021-08-19","",15.5,5.8,58,7.96,32,63.8,"",7.1,110,2900,31,3500,"","","",1150,"",null,null,null,null,null,null,null,null,null,null,null,null,null,"",15.5,5.8,58,7.96,32,63.8,"",7.1,110,2900,31,3500,"","","",{"$f":"IF(OR(LEFT(#REF!,1)=\"<\",LEFT(#REF!,1)=\">\"),VALUE(MID(#REF!,2,5)),#REF!)","v":{"$error":"#REF!"}},{"$f":"IF(OR(LEFT(#REF!,1)=\"<\",LEFT(#REF!,1)=\">\"),VALUE(MID(#REF!,2,5)),#REF!)","v":{"$error":"#REF!"}},{"$f":"IF(OR(LEFT(#REF!,1)=\"<\",LEFT(#REF!,1)=\">\"),VALUE(MID(#REF!,2,5)),#REF!)","v":{"$error":"#REF!"}}]
[18,"15 Risebergabäcken, ca 250 m uppströms från Sege å","2021-10-20","",13.3,9.5,91,7.88,16,40.9,"",4.5,91,1500,100,1700,"","","",1215,"",null,null,null,null,null,null,null,null,null,null,null,null,null,"",13.3,9.5,91,7.88,16,40.9,"",4.5,91,1500,100,1700,"","","",{"$f":"IF(OR(LEFT(#REF!,1)=\"<\",LEFT(#REF!,1)=\">\"),VALUE(MID(#REF!,2,5)),#REF!)","v":{"$error":"#REF!"}},{"$f":"IF(OR(LEFT(#REF!,1)=\"<\",LEFT(#REF!,1)=\">\"),VALUE(MID(#REF!,2,5)),#REF!)","v":{"$error":"#REF!"}},{"$f":"IF(OR(LEFT(#REF!,1)=\"<\",LEFT(#REF!,1)=\">\"),VALUE(MID(#REF!,2,5)),#REF!)","v":{"$error":"#REF!"}}]
[18,"15 Risebergabäcken, ca 250 m uppströms från Sege å","2021-12-20","",7,11.1,92,8.14,4.5,110,"",5.7,56,4900,120,5000,"","","",1305,"",null,null,null,null,null,null,null,null,null,null,null,null,null,"",7,11.1,92,8.14,4.5,110,"",5.7,56,4900,120,5000,"","","",{"$f":"IF(OR(LEFT(#REF!,1)=\"<\",LEFT(#REF!,1)=\">\"),VALUE(MID(#REF!,2,5)),#REF!)","v":{"$error":"#REF!"}},{"$f":"IF(OR(LEFT(#REF!,1)=\"<\",LEFT(#REF!,1)=\">\"),VALUE(MID(#REF!,2,5)),#REF!)","v":{"$error":"#REF!"}},{"$f":"IF(OR(LEFT(#REF!,1)=\"<\",LEFT(#REF!,1)=\">\"),VALUE(MID(#REF!,2,5)),#REF!)","v":{"$error":"#REF!"}}]
[null,null,"Medel",null,10,10.266666666666667,88.666666666666671,8.0466666666666669,10.633333333333333,90.783333333333346,null,5.3500000000000005,63.833333333333336,2333.3333333333335,77.5,2950,null,null,null,null,null,null,null,null,null,null,null,null,null,null,null,null,null,null,0,10,10.266666666666667,88.666666666666671,8.0466666666666669,10.633333333333333,90.783333333333346,0,5.3500000000000005,63.833333333333336,2333.3333333333335,77.5,2950,0,0,0,{"$f":"IF(OR(LEFT(#REF!,1)=\"<\",LEFT(#REF!,1)=\">\"),VALUE(MID(#REF!,2,5)),#REF!)","v":{"$error":"#REF!"}},{"$f":"IF(OR(LEFT(#REF!,1)=\"<\",LEFT(#REF!,1)=\">\"),VALUE(MID(#REF!,2,5)),#REF!)","v":{"$error":"#REF!"}},{"$f":"IF(OR(LEFT(#REF!,1)=\"<\",LEFT(#REF!,1)=\">\"),VALUE(MID(#REF!,2,5)),#REF!)","v":{"$error":"#REF!"}}]
[null,null,"Max",null,15.5,14.5,107,8.24,32,115,null,7.1,110,4900,140,5000,null,null,null,null,null,null,null,null,null,null,null,null,null,null,null,null,null,null,0,15.5,14.5,107,8.24,32,115,0,7.1,110,4900,140,5000,0,0,0,{"$f":"IF(OR(LEFT(#REF!,1)=\"<\",LEFT(#REF!,1)=\">\"),VALUE(MID(#REF!,2,5)),#REF!)","v":{"$error":"#REF!"}},{"$f":"IF(OR(LEFT(#REF!,1)=\"<\",LEFT(#REF!,1)=\">\"),VALUE(MID(#REF!,2,5)),#REF!)","v":{"$error":"#REF!"}},{"$f":"IF(OR(LEFT(#REF!,1)=\"<\",LEFT(#REF!,1)=\">\"),VALUE(MID(#REF!,2,5)),#REF!)","v":{"$error":"#REF!"}}]
[null,null,"Min",null,0.9,5.8,58,7.88,2.6,40.9,null,4.0999999999999996,31,1100,31,1600,null,null,null,null,null,null,null,null,null,null,null,null,null,null,null,null,null,null,0,0.9,5.8,58,7.88,2.6,40.9,0,4.0999999999999996,31,1100,31,1600,0,0,0,{"$f":"IF(OR(LEFT(#REF!,1)=\"<\",LEFT(#REF!,1)=\">\"),VALUE(MID(#REF!,2,5)),#REF!)","v":{"$error":"#REF!"}},{"$f":"IF(OR(LEFT(#REF!,1)=\"<\",LEFT(#REF!,1)=\">\"),VALUE(MID(#REF!,2,5)),#REF!)","v":{"$error":"#REF!"}},{"$f":"IF(OR(LEFT(#REF!,1)=\"<\",LEFT(#REF!,1)=\">\"),VALUE(MID(#REF!,2,5)),#REF!)","v":{"$error":"#REF!"}}]
[null,null,null,null,null,null,null,null,null,null,null,null,null,null,null,null,null,null,null,null,null,null,null,null,null,null,null,null,null,null,null,null,null,null,0,0,0,0,0,0,0,0,0,0,0,0,0,0,0,0,{"$f":"IF(OR(LEFT(#REF!,1)=\"<\",LEFT(#REF!,1)=\">\"),VALUE(MID(#REF!,2,5)),#REF!)","v":{"$error":"#REF!"}},{"$f":"IF(OR(LEFT(#REF!,1)=\"<\",LEFT(#REF!,1)=\">\"),VALUE(MID(#REF!,2,5)),#REF!)","v":{"$error":"#REF!"}},{"$f":"IF(OR(LEFT(#REF!,1)=\"<\",LEFT(#REF!,1)=\">\"),VALUE(MID(#REF!,2,5)),#REF!)","v":{"$error":"#REF!"}}]
[null,null,null,null,null,null,null,null,null,null,null,null,null,null,null,null,null,null,null,null,null,null,null,null,null,null,null,null,null,null,null,null,null,null,0,0,0,0,0,0,0,0,0,0,0,0,0,0,0,0,{"$f":"IF(OR(LEFT(#REF!,1)=\"<\",LEFT(#REF!,1)=\">\"),VALUE(MID(#REF!,2,5)),#REF!)","v":{"$error":"#REF!"}},{"$f":"IF(OR(LEFT(#REF!,1)=\"<\",LEFT(#REF!,1)=\">\"),VALUE(MID(#REF!,2,5)),#REF!)","v":{"$error":"#REF!"}},{"$f":"IF(OR(LEFT(#REF!,1)=\"<\",LEFT(#REF!,1)=\">\"),VALUE(MID(#REF!,2,5)),#REF!)","v":{"$error":"#REF!"}}]
[20,"31 Börringesjön","2021-05-17","",16.3,13.3,136,8.82,36,38.6,"",20,77,"<10","<10",2300,62,0.3,0.3,1000,"gröngrumligt",null,null,null,null,null,null,null,null,null,null,null,null,null,"",16.3,13.3,136,8.82,36,38.6,"",20,77,10,10,2300,62,0.3,0.3,{"$f":"IF(OR(LEFT(#REF!,1)=\"<\",LEFT(#REF!,1)=\">\"),VALUE(MID(#REF!,2,5)),#REF!)","v":{"$error":"#REF!"}},{"$f":"IF(OR(LEFT(#REF!,1)=\"<\",LEFT(#REF!,1)=\">\"),VALUE(MID(#REF!,2,5)),#REF!)","v":{"$error":"#REF!"}},{"$f":"IF(OR(LEFT(#REF!,1)=\"<\",LEFT(#REF!,1)=\">\"),VALUE(MID(#REF!,2,5)),#REF!)","v":{"$error":"#REF!"}}]
[20,"31 Börringesjön","2021-06-14","",19.2,9.6999999999999993,105,8.67,42,39.299999999999997,"",26,96,"<10","<10",2800,54,0.3,0.3,950,"gulgrumligt",null,null,null,null,null,null,null,null,null,null,null,null,null,"",19.2,9.6999999999999993,105,8.67,42,39.299999999999997,"",26,96,10,10,2800,54,0.3,0.3,{"$f":"IF(OR(LEFT(#REF!,1)=\"<\",LEFT(#REF!,1)=\">\"),VALUE(MID(#REF!,2,5)),#REF!)","v":{"$error":"#REF!"}},{"$f":"IF(OR(LEFT(#REF!,1)=\"<\",LEFT(#REF!,1)=\">\"),VALUE(MID(#REF!,2,5)),#REF!)","v":{"$error":"#REF!"}},{"$f":"IF(OR(LEFT(#REF!,1)=\"<\",LEFT(#REF!,1)=\">\"),VALUE(MID(#REF!,2,5)),#REF!)","v":{"$error":"#REF!"}}]
[20,"31 Börringesjön","2021-07-13","",21.6,10.1,114,8.83,30,37.799999999999997,"",22,75,"<10","<10",2200,40,0.4,0.4,920,"gulgrumligt",null,null,null,null,null,null,null,null,null,null,null,null,null,"",21.6,10.1,114,8.83,30,37.799999999999997,"",22,75,10,10,2200,40,0.4,0.4,{"$f":"IF(OR(LEFT(#REF!,1)=\"<\",LEFT(#REF!,1)=\">\"),VALUE(MID(#REF!,2,5)),#REF!)","v":{"$error":"#REF!"}},{"$f":"IF(OR(LEFT(#REF!,1)=\"<\",LEFT(#REF!,1)=\">\"),VALUE(MID(#REF!,2,5)),#REF!)","v":{"$error":"#REF!"}},{"$f":"IF(OR(LEFT(#REF!,1)=\"<\",LEFT(#REF!,1)=\">\"),VALUE(MID(#REF!,2,5)),#REF!)","v":{"$error":"#REF!"}}]
[20,"31 Börringesjön","2021-08-18","",16.2,10,102,8.48,34,35.4,"",20,74,"<10","<10",2100,43,0.3,0.3,1100,"gulgrumligt",null,null,null,null,null,null,null,null,null,null,null,null,null,"",16.2,10,102,8.48,34,35.4,"",20,74,10,10,2100,43,0.3,0.3,{"$f":"IF(OR(LEFT(#REF!,1)=\"<\",LEFT(#REF!,1)=\">\"),VALUE(MID(#REF!,2,5)),#REF!)","v":{"$error":"#REF!"}},{"$f":"IF(OR(LEFT(#REF!,1)=\"<\",LEFT(#REF!,1)=\">\"),VALUE(MID(#REF!,2,5)),#REF!)","v":{"$error":"#REF!"}},{"$f":"IF(OR(LEFT(#REF!,1)=\"<\",LEFT(#REF!,1)=\">\"),VALUE(MID(#REF!,2,5)),#REF!)","v":{"$error":"#REF!"}}]
[20,"31 Börringesjön","2021-09-20","",14.1,11,107,8.58,37,37.1,"",26,98,"<10","<10",2900,80,0.3,0.3,930,"gulgrumligt",null,null,null,null,null,null,null,null,null,null,null,null,null,"",14.1,11,107,8.58,37,37.1,"",26,98,10,10,2900,80,0.3,0.3,{"$f":"IF(OR(LEFT(#REF!,1)=\"<\",LEFT(#REF!,1)=\">\"),VALUE(MID(#REF!,2,5)),#REF!)","v":{"$error":"#REF!"}},{"$f":"IF(OR(LEFT(#REF!,1)=\"<\",LEFT(#REF!,1)=\">\"),VALUE(MID(#REF!,2,5)),#REF!)","v":{"$error":"#REF!"}},{"$f":"IF(OR(LEFT(#REF!,1)=\"<\",LEFT(#REF!,1)=\">\"),VALUE(MID(#REF!,2,5)),#REF!)","v":{"$error":"#REF!"}}]
[null,null,"Medel",null,17.479999999999997,10.82,112.8,8.6759999999999984,35.799999999999997,37.64,null,22.8,84,10,10,2460,55.8,0.32,0.32,null,null,null,null,null,null,null,null,null,null,null,null,null,null,null,0,17.479999999999997,10.82,112.8,8.6759999999999984,35.799999999999997,37.64,{"$f":"IF(OR(LEFT(K103,1)=\"<\",LEFT(K103,1)=\">\"),VALUE(MID(K103,2,5)),K103)","v":0},{"$f":"IF(OR(LEFT(L103,1)=\"<\",LEFT(L103,1)=\">\"),VALUE(MID(L103,2,5)),L103)","v":22.8},{"$f":"IF(OR(LEFT(M103,1)=\"<\",LEFT(M103,1)=\">\"),VALUE(MID(M103,2,5)),M103)","v":84},{"$f":"IF(OR(LEFT(N103,1)=\"<\",LEFT(N103,1)=\">\"),VALUE(MID(N103,2,5)),N103)","v":10},{"$f":"IF(OR(LEFT(O103,1)=\"<\",LEFT(O103,1)=\">\"),VALUE(MID(O103,2,5)),O103)","v":10},{"$f":"IF(OR(LEFT(P103,1)=\"<\",LEFT(P103,1)=\">\"),VALUE(MID(P103,2,5)),P103)","v":2460},{"$f":"IF(OR(LEFT(Q103,1)=\"<\",LEFT(Q103,1)=\">\"),VALUE(MID(Q103,2,5)),Q103)","v":55.8},{"$f":"IF(OR(LEFT(R103,1)=\"<\",LEFT(R103,1)=\">\"),VALUE(MID(R103,2,5)),R103)","v":0.32},{"$f":"IF(OR(LEFT(S103,1)=\"<\",LEFT(S103,1)=\">\"),VALUE(MID(S103,2,5)),S103)","v":0.32},{"$f":"IF(OR(LEFT(#REF!,1)=\"<\",LEFT(#REF!,1)=\">\"),VALUE(MID(#REF!,2,5)),#REF!)","v":{"$error":"#REF!"}},{"$f":"IF(OR(LEFT(#REF!,1)=\"<\",LEFT(#REF!,1)=\">\"),VALUE(MID(#REF!,2,5)),#REF!)","v":{"$error":"#REF!"}},{"$f":"IF(OR(LEFT(#REF!,1)=\"<\",LEFT(#REF!,1)=\">\"),VALUE(MID(#REF!,2,5)),#REF!)","v":{"$error":"#REF!"}}]
[null,null,"Max",null,21.6,13.3,136,8.83,42,39.299999999999997,null,26,98,10,10,2900,80,0.4,0.4,null,null,null,null,null,null,null,null,null,null,null,null,null,null,null,0,21.6,13.3,136,8.83,42,39.299999999999997,0,26,98,10,10,2900,80,0.4,0.4,{"$f":"IF(OR(LEFT(#REF!,1)=\"<\",LEFT(#REF!,1)=\">\"),VALUE(MID(#REF!,2,5)),#REF!)","v":{"$error":"#REF!"}},{"$f":"IF(OR(LEFT(#REF!,1)=\"<\",LEFT(#REF!,1)=\">\"),VALUE(MID(#REF!,2,5)),#REF!)","v":{"$error":"#REF!"}},{"$f":"IF(OR(LEFT(#REF!,1)=\"<\",LEFT(#REF!,1)=\">\"),VALUE(MID(#REF!,2,5)),#REF!)","v":{"$error":"#REF!"}}]
[null,null,"Min",null,14.1,9.6999999999999993,102,8.48,30,35.4,null,20,74,10,10,2100,40,0.3,0.3,null,null,null,null,null,null,null,null,null,null,null,null,null,null,null,0,14.1,9.6999999999999993,102,8.48,30,35.4,0,20,74,10,10,2100,40,0.3,0.3,{"$f":"IF(OR(LEFT(#REF!,1)=\"<\",LEFT(#REF!,1)=\">\"),VALUE(MID(#REF!,2,5)),#REF!)","v":{"$error":"#REF!"}},{"$f":"IF(OR(LEFT(#REF!,1)=\"<\",LEFT(#REF!,1)=\">\"),VALUE(MID(#REF!,2,5)),#REF!)","v":{"$error":"#REF!"}},{"$f":"IF(OR(LEFT(#REF!,1)=\"<\",LEFT(#REF!,1)=\">\"),VALUE(MID(#REF!,2,5)),#REF!)","v":{"$error":"#REF!"}}]
[null,null,null,null,null,null,null,null,null,null,null,null,null,null,null,null,null,null,null,null,null,null,null,null,null,null,null,null,null,null,null,null,null,null,0,0,0,0,0,0,0,0,0,0,0,0,0,0,0,0,{"$f":"IF(OR(LEFT(#REF!,1)=\"<\",LEFT(#REF!,1)=\">\"),VALUE(MID(#REF!,2,5)),#REF!)","v":{"$error":"#REF!"}},{"$f":"IF(OR(LEFT(#REF!,1)=\"<\",LEFT(#REF!,1)=\">\"),VALUE(MID(#REF!,2,5)),#REF!)","v":{"$error":"#REF!"}},{"$f":"IF(OR(LEFT(#REF!,1)=\"<\",LEFT(#REF!,1)=\">\"),VALUE(MID(#REF!,2,5)),#REF!)","v":{"$error":"#REF!"}}]
[22,"32 Fjällfotasjön","2021-05-17","",16.399999999999999,10.6,109,8.8699999999999992,8.9,31.4,"",25,52,"<10","<10",1900,28,0.6,0.6,930,"brungrumligt",null,null,null,null,null,null,null,null,null,null,null,null,null,"",16.399999999999999,10.6,109,8.8699999999999992,8.9,31.4,"",25,52,10,10,1900,28,0.6,0.6,{"$f":"IF(OR(LEFT(#REF!,1)=\"<\",LEFT(#REF!,1)=\">\"),VALUE(MID(#REF!,2,5)),#REF!)","v":{"$error":"#REF!"}},{"$f":"IF(OR(LEFT(#REF!,1)=\"<\",LEFT(#REF!,1)=\">\"),VALUE(MID(#REF!,2,5)),#REF!)","v":{"$error":"#REF!"}},{"$f":"IF(OR(LEFT(#REF!,1)=\"<\",LEFT(#REF!,1)=\">\"),VALUE(MID(#REF!,2,5)),#REF!)","v":{"$error":"#REF!"}}]
[22,"32 Fjällfotasjön","2021-06-14","",19.399999999999999,9.9,108,9.06,16,33,"",28,76,"<10","<10",2200,38,0.6,0.5,900,"gröngrumligt",null,null,null,null,null,null,null,null,null,null,null,null,null,"",19.399999999999999,9.9,108,9.06,16,33,"",28,76,10,10,2200,38,0.6,0.5,{"$f":"IF(OR(LEFT(#REF!,1)=\"<\",LEFT(#REF!,1)=\">\"),VALUE(MID(#REF!,2,5)),#REF!)","v":{"$error":"#REF!"}},{"$f":"IF(OR(LEFT(#REF!,1)=\"<\",LEFT(#REF!,1)=\">\"),VALUE(MID(#REF!,2,5)),#REF!)","v":{"$error":"#REF!"}},{"$f":"IF(OR(LEFT(#REF!,1)=\"<\",LEFT(#REF!,1)=\">\"),VALUE(MID(#REF!,2,5)),#REF!)","v":{"$error":"#REF!"}}]
[22,"32 Fjällfotasjön","2021-07-13","",22.1,9.6,110,8.82,13,32.299999999999997,"",29,54,"<10",14,1900,25,0.6,0.5,830,"gröngrumligt",null,null,null,null,null,null,null,null,null,null,null,null,null,"",22.1,9.6,110,8.82,13,32.299999999999997,"",29,54,10,14,1900,25,0.6,0.5,{"$f":"IF(OR(LEFT(#REF!,1)=\"<\",LEFT(#REF!,1)=\">\"),VALUE(MID(#REF!,2,5)),#REF!)","v":{"$error":"#REF!"}},{"$f":"IF(OR(LEFT(#REF!,1)=\"<\",LEFT(#REF!,1)=\">\"),VALUE(MID(#REF!,2,5)),#REF!)","v":{"$error":"#REF!"}},{"$f":"IF(OR(LEFT(#REF!,1)=\"<\",LEFT(#REF!,1)=\">\"),VALUE(MID(#REF!,2,5)),#REF!)","v":{"$error":"#REF!"}}]
[22,"32 Fjällfotasjön","2021-08-18","",16.600000000000001,8.9,92,8.1199999999999992,12,32.4,"",27,70,"<10",11,2000,23,0.8,0.7,1000,"ganska klart vatten",null,null,null,null,null,null,null,null,null,null,null,null,null,"",16.600000000000001,8.9,92,8.1199999999999992,12,32.4,"",27,70,10,11,2000,23,0.8,0.7,{"$f":"IF(OR(LEFT(#REF!,1)=\"<\",LEFT(#REF!,1)=\">\"),VALUE(MID(#REF!,2,5)),#REF!)","v":{"$error":"#REF!"}},{"$f":"IF(OR(LEFT(#REF!,1)=\"<\",LEFT(#REF!,1)=\">\"),VALUE(MID(#REF!,2,5)),#REF!)","v":{"$error":"#REF!"}},{"$f":"IF(OR(LEFT(#REF!,1)=\"<\",LEFT(#REF!,1)=\">\"),VALUE(MID(#REF!,2,5)),#REF!)","v":{"$error":"#REF!"}}]
[22,"32 Fjällfotasjön","2021-09-20","",14.6,10.1,100,8.16,8.5,34,"",26,51,"<10",170,2100,28,0.7,0.6,845,"gröngrumligt",null,null,null,null,null,null,null,null,null,null,null,null,null,"",14.6,10.1,100,8.16,8.5,34,"",26,51,10,170,2100,28,0.7,0.6,{"$f":"IF(OR(LEFT(#REF!,1)=\"<\",LEFT(#REF!,1)=\">\"),VALUE(MID(#REF!,2,5)),#REF!)","v":{"$error":"#REF!"}},{"$f":"IF(OR(LEFT(#REF!,1)=\"<\",LEFT(#REF!,1)=\">\"),VALUE(MID(#REF!,2,5)),#REF!)","v":{"$error":"#REF!"}},{"$f":"IF(OR(LEFT(#REF!,1)=\"<\",LEFT(#REF!,1)=\">\"),VALUE(MID(#REF!,2,5)),#REF!)","v":{"$error":"#REF!"}}]
[null,null,"Medel",null,17.82,9.82,103.8,8.6059999999999999,11.68,32.619999999999997,null,27,60.6,10,43,2020,28.4,0.65999999999999992,0.57999999999999996,null,null,null,null,null,null,null,null,null,null,null,null,null,null,null,0,17.82,9.82,103.8,8.6059999999999999,11.68,32.619999999999997,0,27,60.6,10,43,2020,28.4,0.65999999999999992,0.57999999999999996,{"$f":"IF(OR(LEFT(#REF!,1)=\"<\",LEFT(#REF!,1)=\">\"),VALUE(MID(#REF!,2,5)),#REF!)","v":{"$error":"#REF!"}},{"$f":"IF(OR(LEFT(#REF!,1)=\"<\",LEFT(#REF!,1)=\">\"),VALUE(MID(#REF!,2,5)),#REF!)","v":{"$error":"#REF!"}},{"$f":"IF(OR(LEFT(#REF!,1)=\"<\",LEFT(#REF!,1)=\">\"),VALUE(MID(#REF!,2,5)),#REF!)","v":{"$error":"#REF!"}}]
[null,null,"Max",null,22.1,10.6,110,9.06,16,34,null,29,76,10,170,2200,38,0.8,0.7,null,null,null,null,null,null,null,null,null,null,null,null,null,null,null,0,22.1,10.6,110,9.06,16,34,0,29,76,10,170,2200,38,0.8,0.7,{"$f":"IF(OR(LEFT(#REF!,1)=\"<\",LEFT(#REF!,1)=\">\"),VALUE(MID(#REF!,2,5)),#REF!)","v":{"$error":"#REF!"}},{"$f":"IF(OR(LEFT(#REF!,1)=\"<\",LEFT(#REF!,1)=\">\"),VALUE(MID(#REF!,2,5)),#REF!)","v":{"$error":"#REF!"}},{"$f":"IF(OR(LEFT(#REF!,1)=\"<\",LEFT(#REF!,1)=\">\"),VALUE(MID(#REF!,2,5)),#REF!)","v":{"$error":"#REF!"}}]
[null,null,"Min",null,14.6,8.9,92,8.1199999999999992,8.5,31.4,null,25,51,10,10,1900,23,0.6,0.5,null,null,null,null,null,null,null,null,null,null,null,null,null,null,null,0,14.6,8.9,92,8.1199999999999992,8.5,31.4,0,25,51,10,10,1900,23,0.6,0.5,{"$f":"IF(OR(LEFT(#REF!,1)=\"<\",LEFT(#REF!,1)=\">\"),VALUE(MID(#REF!,2,5)),#REF!)","v":{"$error":"#REF!"}},{"$f":"IF(OR(LEFT(#REF!,1)=\"<\",LEFT(#REF!,1)=\">\"),VALUE(MID(#REF!,2,5)),#REF!)","v":{"$error":"#REF!"}},{"$f":"IF(OR(LEFT(#REF!,1)=\"<\",LEFT(#REF!,1)=\">\"),VALUE(MID(#REF!,2,5)),#REF!)","v":{"$error":"#REF!"}}]
[null,null,null,null,null,null,null,null,null,null,null,null,null,null,null,null,null,null,null,null,null,null,null,null,null,null,null,null,null,null,null,null,null,null,0,0,0,0,0,0,0,0,0,0,0,0,0,0,0,0,{"$f":"IF(OR(LEFT(#REF!,1)=\"<\",LEFT(#REF!,1)=\">\"),VALUE(MID(#REF!,2,5)),#REF!)","v":{"$error":"#REF!"}},{"$f":"IF(OR(LEFT(#REF!,1)=\"<\",LEFT(#REF!,1)=\">\"),VALUE(MID(#REF!,2,5)),#REF!)","v":{"$error":"#REF!"}},{"$f":"IF(OR(LEFT(#REF!,1)=\"<\",LEFT(#REF!,1)=\">\"),VALUE(MID(#REF!,2,5)),#REF!)","v":{"$error":"#REF!"}}]
[24,"33 Yddingen","2021-05-17","",16.100000000000001,13.4,136,8.75,14,49.5,"",21,40,"<10","<10",2000,90,0.55000000000000004,0.5,800,"gulgrumligt",null,null,null,null,null,null,null,null,null,null,null,null,null,"",16.100000000000001,13.4,136,8.75,14,49.5,"",21,40,10,10,2000,90,0.55000000000000004,0.5,{"$f":"IF(OR(LEFT(#REF!,1)=\"<\",LEFT(#REF!,1)=\">\"),VALUE(MID(#REF!,2,5)),#REF!)","v":{"$error":"#REF!"}},{"$f":"IF(OR(LEFT(#REF!,1)=\"<\",LEFT(#REF!,1)=\">\"),VALUE(MID(#REF!,2,5)),#REF!)","v":{"$error":"#REF!"}},{"$f":"IF(OR(LEFT(#REF!,1)=\"<\",LEFT(#REF!,1)=\">\"),VALUE(MID(#REF!,2,5)),#REF!)","v":{"$error":"#REF!"}}]
[24,"33 Yddingen","2021-06-14","",20.100000000000001,8.3000000000000007,91,8.44,14,48.6,"",22,54,"<10","<10",1900,40,0.55000000000000004,0.5,800,"brungrumligt",null,null,null,null,null,null,null,null,null,null,null,null,null,"",20.100000000000001,8.3000000000000007,91,8.44,14,48.6,"",22,54,10,10,1900,40,0.55000000000000004,0.5,{"$f":"IF(OR(LEFT(#REF!,1)=\"<\",LEFT(#REF!,1)=\">\"),VALUE(MID(#REF!,2,5)),#REF!)","v":{"$error":"#REF!"}},{"$f":"IF(OR(LEFT(#REF!,1)=\"<\",LEFT(#REF!,1)=\">\"),VALUE(MID(#REF!,2,5)),#REF!)","v":{"$error":"#REF!"}},{"$f":"IF(OR(LEFT(#REF!,1)=\"<\",LEFT(#REF!,1)=\">\"),VALUE(MID(#REF!,2,5)),#REF!)","v":{"$error":"#REF!"}}]
[24,"33 Yddingen","2021-07-13","",21.9,9,102,8.6300000000000008,14,49.5,"",21,47,"<10","<10",1700,36,0.4,0.4,745,"gulgrumligt",null,null,null,null,null,null,null,null,null,null,null,null,null,"",21.9,9,102,8.6300000000000008,14,49.5,"",21,47,10,10,1700,36,0.4,0.4,{"$f":"IF(OR(LEFT(#REF!,1)=\"<\",LEFT(#REF!,1)=\">\"),VALUE(MID(#REF!,2,5)),#REF!)","v":{"$error":"#REF!"}},{"$f":"IF(OR(LEFT(#REF!,1)=\"<\",LEFT(#REF!,1)=\">\"),VALUE(MID(#REF!,2,5)),#REF!)","v":{"$error":"#REF!"}},{"$f":"IF(OR(LEFT(#REF!,1)=\"<\",LEFT(#REF!,1)=\">\"),VALUE(MID(#REF!,2,5)),#REF!)","v":{"$error":"#REF!"}}]
[24,"33 Yddingen","2021-08-18","",17,8.8000000000000007,91,8.27,22,50.5,"",20,74,"<10","<10",2100,43,0.6,0.6,845,"grumligt",null,null,null,null,null,null,null,null,null,null,null,null,null,"",17,8.8000000000000007,91,8.27,22,50.5,"",20,74,10,10,2100,43,0.6,0.6,{"$f":"IF(OR(LEFT(#REF!,1)=\"<\",LEFT(#REF!,1)=\">\"),VALUE(MID(#REF!,2,5)),#REF!)","v":{"$error":"#REF!"}},{"$f":"IF(OR(LEFT(#REF!,1)=\"<\",LEFT(#REF!,1)=\">\"),VALUE(MID(#REF!,2,5)),#REF!)","v":{"$error":"#REF!"}},{"$f":"IF(OR(LEFT(#REF!,1)=\"<\",LEFT(#REF!,1)=\">\"),VALUE(MID(#REF!,2,5)),#REF!)","v":{"$error":"#REF!"}}]
[24,"33 Yddingen","2021-09-20","",15.2,9.6,96,8.25,17,49.8,"",20,63,"<50","<10",2300,82,0.55000000000000004,0.5,800,"brungrumligt",null,null,null,null,null,null,null,null,null,null,null,null,null,"",15.2,9.6,96,8.25,17,49.8,"",20,63,50,10,2300,82,0.55000000000000004,0.5,{"$f":"IF(OR(LEFT(#REF!,1)=\"<\",LEFT(#REF!,1)=\">\"),VALUE(MID(#REF!,2,5)),#REF!)","v":{"$error":"#REF!"}},{"$f":"IF(OR(LEFT(#REF!,1)=\"<\",LEFT(#REF!,1)=\">\"),VALUE(MID(#REF!,2,5)),#REF!)","v":{"$error":"#REF!"}},{"$f":"IF(OR(LEFT(#REF!,1)=\"<\",LEFT(#REF!,1)=\">\"),VALUE(MID(#REF!,2,5)),#REF!)","v":{"$error":"#REF!"}}]
[null,null,"Medel",null,18.059999999999999,9.82,103.2,8.468,16.2,49.58,null,20.8,55.6,18,10,2000,58.2,0.53,0.5,null,null,null,null,null,null,null,null,null,null,null,null,null,null,null,0,18.059999999999999,9.82,103.2,8.468,16.2,49.58,0,20.8,55.6,18,10,2000,58.2,0.53,0.5,{"$f":"IF(OR(LEFT(#REF!,1)=\"<\",LEFT(#REF!,1)=\">\"),VALUE(MID(#REF!,2,5)),#REF!)","v":{"$error":"#REF!"}},{"$f":"IF(OR(LEFT(#REF!,1)=\"<\",LEFT(#REF!,1)=\">\"),VALUE(MID(#REF!,2,5)),#REF!)","v":{"$error":"#REF!"}},{"$f":"IF(OR(LEFT(#REF!,1)=\"<\",LEFT(#REF!,1)=\">\"),VALUE(MID(#REF!,2,5)),#REF!)","v":{"$error":"#REF!"}}]
[null,null,"Max",null,21.9,13.4,136,8.75,22,50.5,null,22,74,50,10,2300,90,0.6,0.6,null,null,null,null,null,null,null,null,null,null,null,null,null,null,null,0,21.9,13.4,136,8.75,22,50.5,0,22,74,50,10,2300,90,0.6,0.6,{"$f":"IF(OR(LEFT(#REF!,1)=\"<\",LEFT(#REF!,1)=\">\"),VALUE(MID(#REF!,2,5)),#REF!)","v":{"$error":"#REF!"}},{"$f":"IF(OR(LEFT(#REF!,1)=\"<\",LEFT(#REF!,1)=\">\"),VALUE(MID(#REF!,2,5)),#REF!)","v":{"$error":"#REF!"}},{"$f":"IF(OR(LEFT(#REF!,1)=\"<\",LEFT(#REF!,1)=\">\"),VALUE(MID(#REF!,2,5)),#REF!)","v":{"$error":"#REF!"}}]
[null,null,"Min",null,15.2,8.3000000000000007,91,8.25,14,48.6,null,20,40,10,10,1700,36,0.4,0.4,null,null,null,null,null,null,null,null,null,null,null,null,null,null,null,0,15.2,8.3000000000000007,91,8.25,14,48.6,0,20,40,10,10,1700,36,0.4,0.4,{"$f":"IF(OR(LEFT(#REF!,1)=\"<\",LEFT(#REF!,1)=\">\"),VALUE(MID(#REF!,2,5)),#REF!)","v":{"$error":"#REF!"}},{"$f":"IF(OR(LEFT(#REF!,1)=\"<\",LEFT(#REF!,1)=\">\"),VALUE(MID(#REF!,2,5)),#REF!)","v":{"$error":"#REF!"}},{"$f":"IF(OR(LEFT(#REF!,1)=\"<\",LEFT(#REF!,1)=\">\"),VALUE(MID(#REF!,2,5)),#REF!)","v":{"$error":"#REF!"}}]
[null,null,null,null,null,null,null,null,null,null,null,null,null,null,null,null,null,null,null,null,null,null,null,null,null,null,null,null,null,null,null,null,null,null,0,0,0,0,0,0,0,0,0,0,0,0,0,0,0,0,{"$f":"IF(OR(LEFT(#REF!,1)=\"<\",LEFT(#REF!,1)=\">\"),VALUE(MID(#REF!,2,5)),#REF!)","v":{"$error":"#REF!"}},{"$f":"IF(OR(LEFT(#REF!,1)=\"<\",LEFT(#REF!,1)=\">\"),VALUE(MID(#REF!,2,5)),#REF!)","v":{"$error":"#REF!"}},{"$f":"IF(OR(LEFT(#REF!,1)=\"<\",LEFT(#REF!,1)=\">\"),VALUE(MID(#REF!,2,5)),#REF!)","v":{"$error":"#REF!"}}]
[26,"34 Havgårdssjön","2021-05-17","",16.100000000000001,9.3000000000000007,95,8.31,3.7,30.8,"",7.6,42,180,39,1000,4.2,2,1.8,1030,"ganska klart vatten",null,null,null,null,null,null,null,null,null,null,null,null,null,"",16.100000000000001,9.3000000000000007,95,8.31,3.7,30.8,"",7.6,42,180,39,1000,4.2,2,1.8,{"$f":"IF(OR(LEFT(#REF!,1)=\"<\",LEFT(#REF!,1)=\">\"),VALUE(MID(#REF!,2,5)),#REF!)","v":{"$error":"#REF!"}},{"$f":"IF(OR(LEFT(#REF!,1)=\"<\",LEFT(#REF!,1)=\">\"),VALUE(MID(#REF!,2,5)),#REF!)","v":{"$error":"#REF!"}},{"$f":"IF(OR(LEFT(#REF!,1)=\"<\",LEFT(#REF!,1)=\">\"),VALUE(MID(#REF!,2,5)),#REF!)","v":{"$error":"#REF!"}}]
[26,"34 Havgårdssjön","2021-06-14","",19.100000000000001,8.6999999999999993,94,8.23,4.7,30.6,"",10,56,84,130,1100,8,2,1.8,1030,"klart vatten",null,null,null,null,null,null,null,null,null,null,null,null,null,"",19.100000000000001,8.6999999999999993,94,8.23,4.7,30.6,"",10,56,84,130,1100,8,2,1.8,{"$f":"IF(OR(LEFT(#REF!,1)=\"<\",LEFT(#REF!,1)=\">\"),VALUE(MID(#REF!,2,5)),#REF!)","v":{"$error":"#REF!"}},{"$f":"IF(OR(LEFT(#REF!,1)=\"<\",LEFT(#REF!,1)=\">\"),VALUE(MID(#REF!,2,5)),#REF!)","v":{"$error":"#REF!"}},{"$f":"IF(OR(LEFT(#REF!,1)=\"<\",LEFT(#REF!,1)=\">\"),VALUE(MID(#REF!,2,5)),#REF!)","v":{"$error":"#REF!"}}]
[26,"34 Havgårdssjön","2021-07-13","",22.1,9,103,8.41,3.6,28,"",9.3000000000000007,45,"<10",24,920,8.1999999999999993,2.2000000000000002,2,1000,"klart vatten",null,null,null,null,null,null,null,null,null,null,null,null,null,"",22.1,9,103,8.41,3.6,28,"",9.3000000000000007,45,10,24,920,8.1999999999999993,2.2000000000000002,2,{"$f":"IF(OR(LEFT(#REF!,1)=\"<\",LEFT(#REF!,1)=\">\"),VALUE(MID(#REF!,2,5)),#REF!)","v":{"$error":"#REF!"}},{"$f":"IF(OR(LEFT(#REF!,1)=\"<\",LEFT(#REF!,1)=\">\"),VALUE(MID(#REF!,2,5)),#REF!)","v":{"$error":"#REF!"}},{"$f":"IF(OR(LEFT(#REF!,1)=\"<\",LEFT(#REF!,1)=\">\"),VALUE(MID(#REF!,2,5)),#REF!)","v":{"$error":"#REF!"}}]
[26,"34 Havgårdssjön","2021-08-18","",18.3,9.9,105,8.4700000000000006,6.2,25.6,"",10,58,48,"<10",1200,17,1.5,1.3,1400,"klart vatten",null,null,null,null,null,null,null,null,null,null,null,null,null,"",18.3,9.9,105,8.4700000000000006,6.2,25.6,"",10,58,48,10,1200,17,1.5,1.3,{"$f":"IF(OR(LEFT(#REF!,1)=\"<\",LEFT(#REF!,1)=\">\"),VALUE(MID(#REF!,2,5)),#REF!)","v":{"$error":"#REF!"}},{"$f":"IF(OR(LEFT(#REF!,1)=\"<\",LEFT(#REF!,1)=\">\"),VALUE(MID(#REF!,2,5)),#REF!)","v":{"$error":"#REF!"}},{"$f":"IF(OR(LEFT(#REF!,1)=\"<\",LEFT(#REF!,1)=\">\"),VALUE(MID(#REF!,2,5)),#REF!)","v":{"$error":"#REF!"}}]
[26,"34 Havgårdssjön","2021-09-20","",16,11,112,8.32,6.5,26.9,"",9.3000000000000007,54,"<10",120,1200,26,1.4,1.2,1000,"gröngrumligt",null,null,null,null,null,null,null,null,null,null,null,null,null,"",16,11,112,8.32,6.5,26.9,"",9.3000000000000007,54,10,120,1200,26,1.4,1.2,{"$f":"IF(OR(LEFT(#REF!,1)=\"<\",LEFT(#REF!,1)=\">\"),VALUE(MID(#REF!,2,5)),#REF!)","v":{"$error":"#REF!"}},{"$f":"IF(OR(LEFT(#REF!,1)=\"<\",LEFT(#REF!,1)=\">\"),VALUE(MID(#REF!,2,5)),#REF!)","v":{"$error":"#REF!"}},{"$f":"IF(OR(LEFT(#REF!,1)=\"<\",LEFT(#REF!,1)=\">\"),VALUE(MID(#REF!,2,5)),#REF!)","v":{"$error":"#REF!"}}]
[null,null,"Medel",null,18.32,9.58,101.8,8.3480000000000008,4.9399999999999995,28.380000000000003,null,9.24,51,66.400000000000006,64.599999999999994,1084,12.68,1.8199999999999998,1.6199999999999999,null,null,null,null,null,null,null,null,null,null,null,null,null,null,null,0,18.32,9.58,101.8,8.3480000000000008,4.9399999999999995,28.380000000000003,0,9.24,51,66.400000000000006,64.599999999999994,1084,12.68,1.8199999999999998,1.6199999999999999,{"$f":"IF(OR(LEFT(#REF!,1)=\"<\",LEFT(#REF!,1)=\">\"),VALUE(MID(#REF!,2,5)),#REF!)","v":{"$error":"#REF!"}},{"$f":"IF(OR(LEFT(#REF!,1)=\"<\",LEFT(#REF!,1)=\">\"),VALUE(MID(#REF!,2,5)),#REF!)","v":{"$error":"#REF!"}},{"$f":"IF(OR(LEFT(#REF!,1)=\"<\",LEFT(#REF!,1)=\">\"),VALUE(MID(#REF!,2,5)),#REF!)","v":{"$error":"#REF!"}}]
[null,null,"Max",null,22.1,11,112,8.4700000000000006,6.5,30.8,null,10,58,180,130,1200,26,2.2000000000000002,2,null,null,null,null,null,null,null,null,null,null,null,null,null,null,null,0,22.1,11,112,8.4700000000000006,6.5,30.8,0,10,58,180,130,1200,26,2.2000000000000002,2,{"$f":"IF(OR(LEFT(#REF!,1)=\"<\",LEFT(#REF!,1)=\">\"),VALUE(MID(#REF!,2,5)),#REF!)","v":{"$error":"#REF!"}},{"$f":"IF(OR(LEFT(#REF!,1)=\"<\",LEFT(#REF!,1)=\">\"),VALUE(MID(#REF!,2,5)),#REF!)","v":{"$error":"#REF!"}},{"$f":"IF(OR(LEFT(#REF!,1)=\"<\",LEFT(#REF!,1)=\">\"),VALUE(MID(#REF!,2,5)),#REF!)","v":{"$error":"#REF!"}}]
[null,null,"Min",null,16,8.6999999999999993,94,8.23,3.6,25.6,null,7.6,42,10,10,920,4.2,1.4,1.2,null,null,null,null,null,null,null,null,null,null,null,null,null,null,null,0,16,8.6999999999999993,94,8.23,3.6,25.6,0,7.6,42,10,10,920,4.2,1.4,1.2,{"$f":"IF(OR(LEFT(#REF!,1)=\"<\",LEFT(#REF!,1)=\">\"),VALUE(MID(#REF!,2,5)),#REF!)","v":{"$error":"#REF!"}},{"$f":"IF(OR(LEFT(#REF!,1)=\"<\",LEFT(#REF!,1)=\">\"),VALUE(MID(#REF!,2,5)),#REF!)","v":{"$error":"#REF!"}},{"$f":"IF(OR(LEFT(#REF!,1)=\"<\",LEFT(#REF!,1)=\">\"),VALUE(MID(#REF!,2,5)),#REF!)","v":{"$error":"#REF!"}}]
[null,null,null,null,null,null,null,null,null,null,null,null,null,null,null,null,null,null,null,null,null,null,null,null,null,null,null,null,null,null,null,null,null,null,0,0,0,0,0,0,0,0,0,0,0,0,0,0,0,0,{"$f":"IF(OR(LEFT(#REF!,1)=\"<\",LEFT(#REF!,1)=\">\"),VALUE(MID(#REF!,2,5)),#REF!)","v":{"$error":"#REF!"}},{"$f":"IF(OR(LEFT(#REF!,1)=\"<\",LEFT(#REF!,1)=\">\"),VALUE(MID(#REF!,2,5)),#REF!)","v":{"$error":"#REF!"}},{"$f":"IF(OR(LEFT(#REF!,1)=\"<\",LEFT(#REF!,1)=\">\"),VALUE(MID(#REF!,2,5)),#REF!)","v":{"$error":"#REF!"}}]
[28,"35 Eksholmssjön","2021-08-18","",18,8.6999999999999993,92,7.14,7,11,"",23,58,"<10",10,1100,19,1,0.9,1500,"humöst",null,null,null,null,null,null,null,null,null,null,null,null,null,"",18,8.6999999999999993,92,7.14,7,11,"",23,58,10,10,1100,19,1,0.9,{"$f":"IF(OR(LEFT(#REF!,1)=\"<\",LEFT(#REF!,1)=\">\"),VALUE(MID(#REF!,2,5)),#REF!)","v":{"$error":"#REF!"}},{"$f":"IF(OR(LEFT(#REF!,1)=\"<\",LEFT(#REF!,1)=\">\"),VALUE(MID(#REF!,2,5)),#REF!)","v":{"$error":"#REF!"}},{"$f":"IF(OR(LEFT(#REF!,1)=\"<\",LEFT(#REF!,1)=\">\"),VALUE(MID(#REF!,2,5)),#REF!)","v":{"$error":"#REF!"}}]
[null,null,"Provtaging endast i augusti",null,null,null,null,null,null,null,null,null,null,null,null,null,null,null,null,null,null,null,null,null,null,null,null,null,null,null,null,null,null,null,0,0,0,0,0,0,0,{"$f":"IF(OR(LEFT(K135,1)=\"<\",LEFT(K135,1)=\">\"),VALUE(MID(K135,2,5)),K135)","v":0},{"$f":"IF(OR(LEFT(L135,1)=\"<\",LEFT(L135,1)=\">\"),VALUE(MID(L135,2,5)),L135)","v":0},{"$f":"IF(OR(LEFT(M135,1)=\"<\",LEFT(M135,1)=\">\"),VALUE(MID(M135,2,5)),M135)","v":0},{"$f":"IF(OR(LEFT(N135,1)=\"<\",LEFT(N135,1)=\">\"),VALUE(MID(N135,2,5)),N135)","v":0},{"$f":"IF(OR(LEFT(O135,1)=\"<\",LEFT(O135,1)=\">\"),VALUE(MID(O135,2,5)),O135)","v":0},{"$f":"IF(OR(LEFT(P135,1)=\"<\",LEFT(P135,1)=\">\"),VALUE(MID(P135,2,5)),P135)","v":0},{"$f":"IF(OR(LEFT(Q135,1)=\"<\",LEFT(Q135,1)=\">\"),VALUE(MID(Q135,2,5)),Q135)","v":0},{"$f":"IF(OR(LEFT(R135,1)=\"<\",LEFT(R135,1)=\">\"),VALUE(MID(R135,2,5)),R135)","v":0},{"$f":"IF(OR(LEFT(S135,1)=\"<\",LEFT(S135,1)=\">\"),VALUE(MID(S135,2,5)),S135)","v":0},{"$f":"IF(OR(LEFT(#REF!,1)=\"<\",LEFT(#REF!,1)=\">\"),VALUE(MID(#REF!,2,5)),#REF!)","v":{"$error":"#REF!"}},{"$f":"IF(OR(LEFT(#REF!,1)=\"<\",LEFT(#REF!,1)=\">\"),VALUE(MID(#REF!,2,5)),#REF!)","v":{"$error":"#REF!"}},{"$f":"IF(OR(LEFT(#REF!,1)=\"<\",LEFT(#REF!,1)=\">\"),VALUE(MID(#REF!,2,5)),#REF!)","v":{"$error":"#REF!"}}]
[null,null,null,null,null,null,null,null,null,null,null,null,null,null,null,null,null,null,null,null,null,null,null,null,null,null,null,null,null,null,null,null,null,null,0,0,0,0,0,0,0,0,0,0,0,0,0,0,0,0,{"$f":"IF(OR(LEFT(#REF!,1)=\"<\",LEFT(#REF!,1)=\">\"),VALUE(MID(#REF!,2,5)),#REF!)","v":{"$error":"#REF!"}},{"$f":"IF(OR(LEFT(#REF!,1)=\"<\",LEFT(#REF!,1)=\">\"),VALUE(MID(#REF!,2,5)),#REF!)","v":{"$error":"#REF!"}},{"$f":"IF(OR(LEFT(#REF!,1)=\"<\",LEFT(#REF!,1)=\">\"),VALUE(MID(#REF!,2,5)),#REF!)","v":{"$error":"#REF!"}}]
[30,"A1 Alnarpsån, mynningen","2021-02-15","",0.1,13.3,91,7.92,18,113,"",5.6,63,5700,160,5800,"","","",1315,"istäckt",null,null,null,null,null,null,null,null,null,null,null,null,null,"",0.1,13.3,91,7.92,18,113,"",5.6,63,5700,160,5800,"","","",{"$f":"IF(OR(LEFT(#REF!,1)=\"<\",LEFT(#REF!,1)=\">\"),VALUE(MID(#REF!,2,5)),#REF!)","v":{"$error":"#REF!"}},{"$f":"IF(OR(LEFT(#REF!,1)=\"<\",LEFT(#REF!,1)=\">\"),VALUE(MID(#REF!,2,5)),#REF!)","v":{"$error":"#REF!"}},{"$f":"IF(OR(LEFT(#REF!,1)=\"<\",LEFT(#REF!,1)=\">\"),VALUE(MID(#REF!,2,5)),#REF!)","v":{"$error":"#REF!"}}]
[30,"A1 Alnarpsån, mynningen","2021-04-19","",6.6,18.5,151,7.73,5.4,100,"",6,52,3400,26,3900,"","","",800,"",null,null,null,null,null,null,null,null,null,null,null,null,null,"",6.6,18.5,151,7.73,5.4,100,"",6,52,3400,26,3900,"","","",{"$f":"IF(OR(LEFT(#REF!,1)=\"<\",LEFT(#REF!,1)=\">\"),VALUE(MID(#REF!,2,5)),#REF!)","v":{"$error":"#REF!"}},{"$f":"IF(OR(LEFT(#REF!,1)=\"<\",LEFT(#REF!,1)=\">\"),VALUE(MID(#REF!,2,5)),#REF!)","v":{"$error":"#REF!"}},{"$f":"IF(OR(LEFT(#REF!,1)=\"<\",LEFT(#REF!,1)=\">\"),VALUE(MID(#REF!,2,5)),#REF!)","v":{"$error":"#REF!"}}]
[30,"A1 Alnarpsån, mynningen","2021-06-15","",16.399999999999999,4.4000000000000004,45,7.69,5.4,98.3,"",6.9,130,2300,41,2800,"","","",750,"",null,null,null,null,null,null,null,null,null,null,null,null,null,"",16.399999999999999,4.4000000000000004,45,7.69,5.4,98.3,"",6.9,130,2300,41,2800,"","","",{"$f":"IF(OR(LEFT(#REF!,1)=\"<\",LEFT(#REF!,1)=\">\"),VALUE(MID(#REF!,2,5)),#REF!)","v":{"$error":"#REF!"}},{"$f":"IF(OR(LEFT(#REF!,1)=\"<\",LEFT(#REF!,1)=\">\"),VALUE(MID(#REF!,2,5)),#REF!)","v":{"$error":"#REF!"}},{"$f":"IF(OR(LEFT(#REF!,1)=\"<\",LEFT(#REF!,1)=\">\"),VALUE(MID(#REF!,2,5)),#REF!)","v":{"$error":"#REF!"}}]
[30,"A1 Alnarpsån, mynningen","2021-08-19","",15.7,5.5,56,7.55,5.7,78,"",9.3000000000000007,120,1700,68,1900,"","","",1120,"",null,null,null,null,null,null,null,null,null,null,null,null,null,"",15.7,5.5,56,7.55,5.7,78,"",9.3000000000000007,120,1700,68,1900,"","","",{"$f":"IF(OR(LEFT(#REF!,1)=\"<\",LEFT(#REF!,1)=\">\"),VALUE(MID(#REF!,2,5)),#REF!)","v":{"$error":"#REF!"}},{"$f":"IF(OR(LEFT(#REF!,1)=\"<\",LEFT(#REF!,1)=\">\"),VALUE(MID(#REF!,2,5)),#REF!)","v":{"$error":"#REF!"}},{"$f":"IF(OR(LEFT(#REF!,1)=\"<\",LEFT(#REF!,1)=\">\"),VALUE(MID(#REF!,2,5)),#REF!)","v":{"$error":"#REF!"}}]
[30,"A1 Alnarpsån, mynningen","2021-10-20","",12.6,7.2,68,7.7,20,50.3,"",3.8,110,740,44,1000,"","","",1145,"",null,null,null,null,null,null,null,null,null,null,null,null,null,"",12.6,7.2,68,7.7,20,50.3,"",3.8,110,740,44,1000,"","","",{"$f":"IF(OR(LEFT(#REF!,1)=\"<\",LEFT(#REF!,1)=\">\"),VALUE(MID(#REF!,2,5)),#REF!)","v":{"$error":"#REF!"}},{"$f":"IF(OR(LEFT(#REF!,1)=\"<\",LEFT(#REF!,1)=\">\"),VALUE(MID(#REF!,2,5)),#REF!)","v":{"$error":"#REF!"}},{"$f":"IF(OR(LEFT(#REF!,1)=\"<\",LEFT(#REF!,1)=\">\"),VALUE(MID(#REF!,2,5)),#REF!)","v":{"$error":"#REF!"}}]
[30,"A1 Alnarpsån, mynningen","2021-12-20","",4.4000000000000004,10.7,83,7.99,3.4,102,"",5.8,74,12000,55,12000,"","","",1245,"",null,null,null,null,null,null,null,null,null,null,null,null,null,"",4.4000000000000004,10.7,83,7.99,3.4,102,"",5.8,74,12000,55,12000,"","","",{"$f":"IF(OR(LEFT(#REF!,1)=\"<\",LEFT(#REF!,1)=\">\"),VALUE(MID(#REF!,2,5)),#REF!)","v":{"$error":"#REF!"}},{"$f":"IF(OR(LEFT(#REF!,1)=\"<\",LEFT(#REF!,1)=\">\"),VALUE(MID(#REF!,2,5)),#REF!)","v":{"$error":"#REF!"}},{"$f":"IF(OR(LEFT(#REF!,1)=\"<\",LEFT(#REF!,1)=\">\"),VALUE(MID(#REF!,2,5)),#REF!)","v":{"$error":"#REF!"}}]
[null,null,"Medel",null,9.2999999999999989,9.9333333333333353,82.333333333333329,7.7633333333333345,9.65,90.266666666666666,null,6.2333333333333334,91.5,4306.666666666667,65.666666666666671,4566.666666666667,null,null,null,null,null,null,null,null,null,null,null,null,null,null,null,null,null,null,0,9.2999999999999989,9.9333333333333353,82.333333333333329,7.7633333333333345,9.65,90.266666666666666,0,6.2333333333333334,91.5,4306.666666666667,65.666666666666671,4566.666666666667,0,0,0,{"$f":"IF(OR(LEFT(#REF!,1)=\"<\",LEFT(#REF!,1)=\">\"),VALUE(MID(#REF!,2,5)),#REF!)","v":{"$error":"#REF!"}},{"$f":"IF(OR(LEFT(#REF!,1)=\"<\",LEFT(#REF!,1)=\">\"),VALUE(MID(#REF!,2,5)),#REF!)","v":{"$error":"#REF!"}},{"$f":"IF(OR(LEFT(#REF!,1)=\"<\",LEFT(#REF!,1)=\">\"),VALUE(MID(#REF!,2,5)),#REF!)","v":{"$error":"#REF!"}}]
[null,null,"Max",null,16.399999999999999,18.5,151,7.99,20,113,null,9.3000000000000007,130,12000,160,12000,null,null,null,null,null,null,null,null,null,null,null,null,null,null,null,null,null,null,0,16.399999999999999,18.5,151,7.99,20,113,0,9.3000000000000007,130,12000,160,12000,0,0,0,{"$f":"IF(OR(LEFT(#REF!,1)=\"<\",LEFT(#REF!,1)=\">\"),VALUE(MID(#REF!,2,5)),#REF!)","v":{"$error":"#REF!"}},{"$f":"IF(OR(LEFT(#REF!,1)=\"<\",LEFT(#REF!,1)=\">\"),VALUE(MID(#REF!,2,5)),#REF!)","v":{"$error":"#REF!"}},{"$f":"IF(OR(LEFT(#REF!,1)=\"<\",LEFT(#REF!,1)=\">\"),VALUE(MID(#REF!,2,5)),#REF!)","v":{"$error":"#REF!"}}]
[null,null,"Min",null,0.1,4.4000000000000004,45,7.55,3.4,50.3,null,3.8,52,740,26,1000,null,null,null,null,null,null,null,null,null,null,null,null,null,null,null,null,null,null,0,0.1,4.4000000000000004,45,7.55,3.4,50.3,0,3.8,52,740,26,1000,0,0,0,{"$f":"IF(OR(LEFT(#REF!,1)=\"<\",LEFT(#REF!,1)=\">\"),VALUE(MID(#REF!,2,5)),#REF!)","v":{"$error":"#REF!"}},{"$f":"IF(OR(LEFT(#REF!,1)=\"<\",LEFT(#REF!,1)=\">\"),VALUE(MID(#REF!,2,5)),#REF!)","v":{"$error":"#REF!"}},{"$f":"IF(OR(LEFT(#REF!,1)=\"<\",LEFT(#REF!,1)=\">\"),VALUE(MID(#REF!,2,5)),#REF!)","v":{"$error":"#REF!"}}]
[null,null,null,null,null,null,null,null,null,null,null,null,null,null,null,null,null,null,null,null,null,null,null,null,null,null,null,null,null,null,null,null,null,null,0,0,0,0,0,0,0,0,0,0,0,0,0,0,0,0,{"$f":"IF(OR(LEFT(#REF!,1)=\"<\",LEFT(#REF!,1)=\">\"),VALUE(MID(#REF!,2,5)),#REF!)","v":{"$error":"#REF!"}},{"$f":"IF(OR(LEFT(#REF!,1)=\"<\",LEFT(#REF!,1)=\">\"),VALUE(MID(#REF!,2,5)),#REF!)","v":{"$error":"#REF!"}},{"$f":"IF(OR(LEFT(#REF!,1)=\"<\",LEFT(#REF!,1)=\">\"),VALUE(MID(#REF!,2,5)),#REF!)","v":{"$error":"#REF!"}}]
[32,"A4 Alnarpsån, Coyetgården","2021-02-15","",0.1,18.5,127,8.36,8,88.1,"",3.4,130,6100,300,6300,"","","",1330,"istäckt",null,null,null,null,null,null,null,null,null,null,null,null,null,"",0.1,18.5,127,8.36,8,88.1,"",3.4,130,6100,300,6300,"","","",{"$f":"IF(OR(LEFT(#REF!,1)=\"<\",LEFT(#REF!,1)=\">\"),VALUE(MID(#REF!,2,5)),#REF!)","v":{"$error":"#REF!"}},{"$f":"IF(OR(LEFT(#REF!,1)=\"<\",LEFT(#REF!,1)=\">\"),VALUE(MID(#REF!,2,5)),#REF!)","v":{"$error":"#REF!"}},{"$f":"IF(OR(LEFT(#REF!,1)=\"<\",LEFT(#REF!,1)=\">\"),VALUE(MID(#REF!,2,5)),#REF!)","v":{"$error":"#REF!"}}]
[32,"A4 Alnarpsån, Coyetgården","2021-04-19","",8.6,8.6,74,8.17,1.4,86.1,"",3.2,16,3800,"<10",4400,"","","",815,"",null,null,null,null,null,null,null,null,null,null,null,null,null,"",8.6,8.6,74,8.17,1.4,86.1,"",3.2,16,3800,10,4400,"","","",{"$f":"IF(OR(LEFT(#REF!,1)=\"<\",LEFT(#REF!,1)=\">\"),VALUE(MID(#REF!,2,5)),#REF!)","v":{"$error":"#REF!"}},{"$f":"IF(OR(LEFT(#REF!,1)=\"<\",LEFT(#REF!,1)=\">\"),VALUE(MID(#REF!,2,5)),#REF!)","v":{"$error":"#REF!"}},{"$f":"IF(OR(LEFT(#REF!,1)=\"<\",LEFT(#REF!,1)=\">\"),VALUE(MID(#REF!,2,5)),#REF!)","v":{"$error":"#REF!"}}]
[32,"A4 Alnarpsån, Coyetgården","2021-06-15","",14.3,9.6,94,8.06,2.1,97,"",5.2,97,1200,100,1600,"","","",730,"",null,null,null,null,null,null,null,null,null,null,null,null,null,"",14.3,9.6,94,8.06,2.1,97,"",5.2,97,1200,100,1600,"","","",{"$f":"IF(OR(LEFT(#REF!,1)=\"<\",LEFT(#REF!,1)=\">\"),VALUE(MID(#REF!,2,5)),#REF!)","v":{"$error":"#REF!"}},{"$f":"IF(OR(LEFT(#REF!,1)=\"<\",LEFT(#REF!,1)=\">\"),VALUE(MID(#REF!,2,5)),#REF!)","v":{"$error":"#REF!"}},{"$f":"IF(OR(LEFT(#REF!,1)=\"<\",LEFT(#REF!,1)=\">\"),VALUE(MID(#REF!,2,5)),#REF!)","v":{"$error":"#REF!"}}]
[32,"A4 Alnarpsån, Coyetgården","2021-08-19","",13.7,6.1,59,8.1999999999999993,2.2999999999999998,49.5,"",5.6,72,470,17,800,"","","",1100,"",null,null,null,null,null,null,null,null,null,null,null,null,null,"",13.7,6.1,59,8.1999999999999993,2.2999999999999998,49.5,"",5.6,72,470,17,800,"","","",{"$f":"IF(OR(LEFT(#REF!,1)=\"<\",LEFT(#REF!,1)=\">\"),VALUE(MID(#REF!,2,5)),#REF!)","v":{"$error":"#REF!"}},{"$f":"IF(OR(LEFT(#REF!,1)=\"<\",LEFT(#REF!,1)=\">\"),VALUE(MID(#REF!,2,5)),#REF!)","v":{"$error":"#REF!"}},{"$f":"IF(OR(LEFT(#REF!,1)=\"<\",LEFT(#REF!,1)=\">\"),VALUE(MID(#REF!,2,5)),#REF!)","v":{"$error":"#REF!"}}]
[32,"A4 Alnarpsån, Coyetgården","2021-10-20","",13.2,9.1,87,7.75,6,49.1,"",5.2,110,1000,25,1500,"","","",1130,"",null,null,null,null,null,null,null,null,null,null,null,null,null,"",13.2,9.1,87,7.75,6,49.1,"",5.2,110,1000,25,1500,"","","",{"$f":"IF(OR(LEFT(#REF!,1)=\"<\",LEFT(#REF!,1)=\">\"),VALUE(MID(#REF!,2,5)),#REF!)","v":{"$error":"#REF!"}},{"$f":"IF(OR(LEFT(#REF!,1)=\"<\",LEFT(#REF!,1)=\">\"),VALUE(MID(#REF!,2,5)),#REF!)","v":{"$error":"#REF!"}},{"$f":"IF(OR(LEFT(#REF!,1)=\"<\",LEFT(#REF!,1)=\">\"),VALUE(MID(#REF!,2,5)),#REF!)","v":{"$error":"#REF!"}}]
[32,"A4 Alnarpsån, Coyetgården","2021-12-20","",5.3,12.2,96,8.17,2.2000000000000002,88.1,"",3.4,90,11000,19,11000,"","","",1230,"",null,null,null,null,null,null,null,null,null,null,null,null,null,"",5.3,12.2,96,8.17,2.2000000000000002,88.1,"",3.4,90,11000,19,11000,"","","",{"$f":"IF(OR(LEFT(#REF!,1)=\"<\",LEFT(#REF!,1)=\">\"),VALUE(MID(#REF!,2,5)),#REF!)","v":{"$error":"#REF!"}},{"$f":"IF(OR(LEFT(#REF!,1)=\"<\",LEFT(#REF!,1)=\">\"),VALUE(MID(#REF!,2,5)),#REF!)","v":{"$error":"#REF!"}},{"$f":"IF(OR(LEFT(#REF!,1)=\"<\",LEFT(#REF!,1)=\">\"),VALUE(MID(#REF!,2,5)),#REF!)","v":{"$error":"#REF!"}}]
[null,null,"Medel",{"$error":"#DIV/0!"},9.2000000000000011,10.683333333333335,89.5,8.1183333333333341,3.6666666666666665,76.316666666666663,{"$error":"#DIV/0!"},4.333333333333333,85.833333333333329,3928.3333333333335,78.5,4266.666666666667,null,null,null,null,null,null,null,null,null,null,null,null,null,null,null,null,null,null,{"$error":"#DIV/0!"},9.2000000000000011,10.683333333333335,89.5,8.1183333333333341,3.6666666666666665,76.316666666666663,{"$error":"#DIV/0!"},4.333333333333333,85.833333333333329,3928.3333333333335,78.5,4266.666666666667,0,0,0,{"$f":"IF(OR(LEFT(#REF!,1)=\"<\",LEFT(#REF!,1)=\">\"),VALUE(MID(#REF!,2,5)),#REF!)","v":{"$error":"#REF!"}},{"$f":"IF(OR(LEFT(#REF!,1)=\"<\",LEFT(#REF!,1)=\">\"),VALUE(MID(#REF!,2,5)),#REF!)","v":{"$error":"#REF!"}},{"$f":"IF(OR(LEFT(#REF!,1)=\"<\",LEFT(#REF!,1)=\">\"),VALUE(MID(#REF!,2,5)),#REF!)","v":{"$error":"#REF!"}}]
[null,null,"Max",0,14.3,18.5,127,8.36,8,97,0,5.6,130,11000,300,11000,null,null,null,null,null,null,null,null,null,null,null,null,null,null,null,null,null,null,0,14.3,18.5,127,8.36,8,97,0,5.6,130,11000,300,11000,0,0,0,{"$f":"IF(OR(LEFT(#REF!,1)=\"<\",LEFT(#REF!,1)=\">\"),VALUE(MID(#REF!,2,5)),#REF!)","v":{"$error":"#REF!"}},{"$f":"IF(OR(LEFT(#REF!,1)=\"<\",LEFT(#REF!,1)=\">\"),VALUE(MID(#REF!,2,5)),#REF!)","v":{"$error":"#REF!"}},{"$f":"IF(OR(LEFT(#REF!,1)=\"<\",LEFT(#REF!,1)=\">\"),VALUE(MID(#REF!,2,5)),#REF!)","v":{"$error":"#REF!"}}]
[null,null,"Min",0,0.1,6.1,59,7.75,1.4,49.1,0,3.2,16,470,10,800,null,null,null,null,null,null,null,null,null,null,null,null,null,null,null,null,null,null,0,0.1,6.1,59,7.75,1.4,49.1,0,3.2,16,470,10,800,0,0,0,{"$f":"IF(OR(LEFT(#REF!,1)=\"<\",LEFT(#REF!,1)=\">\"),VALUE(MID(#REF!,2,5)),#REF!)","v":{"$error":"#REF!"}},{"$f":"IF(OR(LEFT(#REF!,1)=\"<\",LEFT(#REF!,1)=\">\"),VALUE(MID(#REF!,2,5)),#REF!)","v":{"$error":"#REF!"}},{"$f":"IF(OR(LEFT(#REF!,1)=\"<\",LEFT(#REF!,1)=\">\"),VALUE(MID(#REF!,2,5)),#REF!)","v":{"$error":"#REF!"}}]

{"sheet":"Stn 18","index":4,"n_rows":59,"n_cols":8,"rows_kept":59,"cut":false,"hidden":false,"merged":[]}
[]
["Sege å"]
["Veckoprov stn 18"]
[]
["Provtagningspunkt","Vecka ","Provtagn."," Temp"," Syreh","Syrem","Kond","Anmärkning"]
["Nr Läge","nr","datum","  °C","  mg/l","   %","mS/m"]
["18 Sege å, nordväst Valdemarsro, järnvägsbron",1,"2021-01-05",2,12.6,91,78.5]
["18 Sege å, nordväst Valdemarsro, järnvägsbron",2,"2021-01-12",3.9,12,91,69.8]
["18 Sege å, nordväst Valdemarsro, järnvägsbron",3,"2021-01-20",3.5,12.1,91,57.7,"högflöde"]
["18 Sege å, nordväst Valdemarsro, järnvägsbron",4,"2021-01-28",2.1,12.6,91,72.5]
["18 Sege å, nordväst Valdemarsro, järnvägsbron",5,"2021-02-03",1.4,14.6,104,70.900000000000006]
["18 Sege å, nordväst Valdemarsro, järnvägsbron",6,"2021-02-10",0,13.7,94,78.8]
["18 Sege å, nordväst Valdemarsro, järnvägsbron",7,"2021-02-15",0.1,13.5,92,78.2]
["18 Sege å, nordväst Valdemarsro, järnvägsbron",8,"2021-02-23",3.3,13.8,103,65.8]
["18 Sege å, nordväst Valdemarsro, järnvägsbron",9,"2021-03-04",4.4000000000000004,13.1,101,70]
["18 Sege å, nordväst Valdemarsro, järnvägsbron",10,"2021-03-10",2.5,14.1,103,71.5]
["18 Sege å, nordväst Valdemarsro, järnvägsbron",11,"2021-03-17",5.4,12.5,99,69]
["18 Sege å, nordväst Valdemarsro, järnvägsbron",12,"2021-03-23",6.1,11.6,94,70.8]
["18 Sege å, nordväst Valdemarsro, järnvägsbron",13,"2021-04-01",9.6,10.5,92,68.900000000000006]
["18 Sege å, nordväst Valdemarsro, järnvägsbron",14,"2021-04-08",6.1,12.2,98,68.3]
["18 Sege å, nordväst Valdemarsro, järnvägsbron",15,"2021-04-13",6.4,12,98,64]
["18 Sege å, nordväst Valdemarsro, järnvägsbron",16,"2021-04-19",9.5,10.4,91,70.099999999999994]
["18 Sege å, nordväst Valdemarsro, järnvägsbron",17,"2021-04-29",9.4,10.6,93,70.8]
["18 Sege å, nordväst Valdemarsro, järnvägsbron",18,"2021-05-04",9.3000000000000007,10.1,88,67.5]
["18 Sege å, nordväst Valdemarsro, järnvägsbron",19,"2021-05-11",15,9.1,91,69.099999999999994]
["18 Sege å, nordväst Valdemarsro, järnvägsbron",20,"2021-05-17",16.100000000000001,10.1,103,65.599999999999994]
["18 Sege å, nordväst Valdemarsro, järnvägsbron",21,"2021-05-25",14.2,7.5,73,67.400000000000006]
["18 Sege å, nordväst Valdemarsro, järnvägsbron",22,"2021-06-01",16.7,6.8,70,67.099999999999994]
["18 Sege å, nordväst Valdemarsro, järnvägsbron",23,"2021-06-08",18.899999999999999,6.5,70,70.7]
["18 Sege å, nordväst Valdemarsro, järnvägsbron",24,"2021-06-15",17.2,5.7,59,73.5]
["18 Sege å, nordväst Valdemarsro, järnvägsbron",25,"2021-06-22",19.3,3.6,39,73.5]
["18 Sege å, nordväst Valdemarsro, järnvägsbron",26,"2021-06-29",18.5,5.7,61,76.7]
["18 Sege å, nordväst Valdemarsro, järnvägsbron",27,"2021-07-08",19.8,4.8,53,45.8]
["18 Sege å, nordväst Valdemarsro, järnvägsbron",28,"2021-07-13",19.7,5.6,61,55.5]
["18 Sege å, nordväst Valdemarsro, järnvägsbron",29,"2021-07-20",19,4.5999999999999996,50,65.099999999999994]
["18 Sege å, nordväst Valdemarsro, järnvägsbron",30,null,null,null,""]
["18 Sege å, nordväst Valdemarsro, järnvägsbron",31,"2021-08-04",16.600000000000001,5.5,57,69]
["18 Sege å, nordväst Valdemarsro, järnvägsbron",32,"2021-08-11",16.600000000000001,5.2,53,52]
["18 Sege å, nordväst Valdemarsro, järnvägsbron",33,"2021-08-19",15.6,6.6,66,45.1]
["18 Sege å, nordväst Valdemarsro, järnvägsbron",34,"2021-08-24",14.4,6.1,60,58.3]
["18 Sege å, nordväst Valdemarsro, järnvägsbron",35,"2021-09-01",15.6,5.7,57,56.8]
["18 Sege å, nordväst Valdemarsro, järnvägsbron",36,"2021-09-08",14.8,7.2,71,70.3]
["18 Sege å, nordväst Valdemarsro, järnvägsbron",37,"2021-09-14",15.9,5.5,56,73.7]
["18 Sege å, nordväst Valdemarsro, järnvägsbron",38,"2021-09-20",13.7,7.6,74,68.8]
["18 Sege å, nordväst Valdemarsro, järnvägsbron",39,"2021-09-30",13.8,8.3000000000000007,80,40.700000000000003]
["18 Sege å, nordväst Valdemarsro, järnvägsbron",40,"2021-10-06",13.2,7.3,70,52.5]
["18 Sege å, nordväst Valdemarsro, järnvägsbron",41,"2021-10-14",10.1,8.9,79,69]
["18 Sege å, nordväst Valdemarsro, järnvägsbron",42,"2021-10-20",12,8.3000000000000007,77,59.6]
["18 Sege å, nordväst Valdemarsro, järnvägsbron",43,"2021-10-26",9.1,8.8000000000000007,77,70.3]
["18 Sege å, nordväst Valdemarsro, järnvägsbron",44,"2021-11-02",10.6,7.6,69,73.099999999999994]
["18 Sege å, nordväst Valdemarsro, järnvägsbron",45,"2021-11-09",10,8.9,79,68.2]
["18 Sege å, nordväst Valdemarsro, järnvägsbron",46,"2021-11-17",7.9,8.9,75,73.2]
["18 Sege å, nordväst Valdemarsro, järnvägsbron",47,"2021-11-23",6.4,10.6,86,72.400000000000006]
["18 Sege å, nordväst Valdemarsro, järnvägsbron",48,"2021-11-30",5.2,10.9,86,109]
["18 Sege å, nordväst Valdemarsro, järnvägsbron",49,"2021-12-09",1.9,12.2,88,63.7]
["18 Sege å, nordväst Valdemarsro, järnvägsbron",50,"2021-12-15",5.2,11.2,88,66.2]
["18 Sege å, nordväst Valdemarsro, järnvägsbron",51,"2021-12-20",3.4,11.5,86,69.400000000000006]
["18 Sege å, nordväst Valdemarsro, järnvägsbron",52,"2021-12-28",1.4,12.9,92,75]
["18 Sege å, nordväst Valdemarsro, järnvägsbron",53,null,null,null,""]

{"sheet":"Vattenföring","index":5,"n_rows":467,"n_cols":9,"rows_kept":467,"cut":false,"hidden":false,"merged":[]}
[]
["Sege å"]
["Vattenföring"]
[]
[]
["Provtagnings-","Svedala, mätstation"]
["datum","m3/s"]
["2021-02-15",0.48599999999999999]
[]
[]
[]
[]
[]
[]
[]
[]
[]
[]
[]
[]
[]
[]
[]
[]
[]
[]
[]
[]
[]
[]
[]
[]
[]
[]
[]
[null,null,"  SMHI mätstation Svedala, 1879",null,null,null,null,"Data från SMHI mätstation Svedala, 1879"]
[]
[]
[]
[]
[]
[]
[]
[]
[]
[]
[]
[]
[]
[]
[]
[]
[]
[]
[]
[]
[]
[]
[]
[]
[]
[]
[]
[]
[]
[]
[]
[]
[]
[]
[]
[]
[]
[]
[]
[]
[]
[]
[]
[]
[]
[]
[]
[]
[]
[]
[]
[]
[]
[]
[]
[]
[]
[]
[]
[]
[]
[]
["Data från SMHI mätstation Högsmölla, 2117",null,null,null,null,null,"Månadsmedel 1991-2020, Svedala"]
["Datum","Mätstation","S-hype",null,null,null,"Medel","Max","Min"]
["2021-01-01",0.45200000000000001,null,null,null,"Jan",0.93772827956989324,3.46,4.7E-2]
[{"$f":"A101+1","v":"2021-01-02"},0.45,null,null,null,"Feb",0.89654398584905493,3.38,9.7299999999999998E-2]
[{"$f":"A102+1","v":"2021-01-03"},0.41199999999999998,null,null,null,"Mar",0.80842043010752718,3.24,0.19700000000000001]
["2021-01-04",0.40899999999999997,null,null,null,"Apr",0.51587177777777782,1.99,7.3300000000000004E-2]
["2021-01-05",0.42599999999999999,null,null,null,"Maj",0.29212290322580658,1.86,4.3700000000000003E-2]
["2021-01-06",0.44800000000000001,null,null,null,"Juni",0.17120633333333304,1.68,3.1399999999999997E-2]
["2021-01-07",0.499,null,null,null,"Juli",0.16792709677419368,2.86,2.81E-2]
["2021-01-08",0.53200000000000003,null,null,null,"Aug",0.16073290322580616,1.61,1.9900000000000001E-2]
["2021-01-09",0.56000000000000005,null,null,null,"Sep",0.16920311111111103,1.64,1.29E-2]
["2021-01-10",0.56799999999999995,null,null,null,"Okt",0.20902545161290317,3.39,9.4000000000000004E-3]
["2021-01-11",0.67500000000000004,null,null,null,"Nov",0.38029867777777832,2.5099999999999998,4.0899999999999999E-3]
["2021-01-12",1,null,null,null,"Dec",0.66519419354838716,2.56,1.84E-2]
["2021-01-13",0.93700000000000006]
["2021-01-14",0.99]
["2021-01-15",0.873]
["2021-01-16",0.81799999999999995]
["2021-01-17",0.78500000000000003]
["2021-01-18",0.76600000000000001]
["2021-01-19",0.83899999999999997]
["2021-01-20",1.5]
["2021-01-21",1.88]
["2021-01-22",1.74]
["2021-01-23",1.76]
["2021-01-24",1.77]
["2021-01-25",1.78]
["2021-01-26",1.73]
["2021-01-27",1.63]
["2021-01-28",1.56]
["2021-01-29",1.41]
["2021-01-30",1.27]
["2021-01-31",1.19]
["2021-02-01",1.1000000000000001]
["2021-02-02",1.02]
["2021-02-03",0.93899999999999995]
["2021-02-04",0.874]
["2021-02-05",0.81200000000000006]
["2021-02-06",0.75600000000000001]
["2021-02-07",0.71299999999999997]
["2021-02-08",0.68200000000000005]
["2021-02-09",0.65500000000000003]
["2021-02-10",0.629]
["2021-02-11",0.59]
["2021-02-12",0.55300000000000005]
["2021-02-13",0.52400000000000002]
["2021-02-14",0.504]
["2021-02-15",0.48599999999999999]
["2021-02-16",0.47899999999999998]
["2021-02-17",0.57999999999999996]
["2021-02-18",0.627]
["2021-02-19",1.1000000000000001]
["2021-02-20",1.05]
["2021-02-21",0.96]
["2021-02-22",0.93300000000000005]
["2021-02-23",0.92500000000000004]
["2021-02-24",0.92700000000000005]
["2021-02-25",0.91600000000000004]
["2021-02-26",0.89900000000000002]
["2021-02-27",0.88100000000000001]
["2021-02-28",0.85599999999999998]
["2021-03-01",0.82599999999999996]
["2021-03-02",0.79600000000000004]
["2021-03-03",0.77400000000000002]
["2021-03-04",0.76400000000000001]
["2021-03-05",0.73799999999999999]
["2021-03-06",0.70899999999999996]
["2021-03-07",0.68700000000000006]
[{"$f":"A166+1","v":"2021-03-08"},0.66600000000000004]
["2021-03-09",0.64700000000000002]
["2021-03-10",0.63]
["2021-03-11",0.68200000000000005]
["2021-03-12",0.751]
["2021-03-13",0.95199999999999996]
["2021-03-14",1.22]
["2021-03-15",1.02]
["2021-03-16",0.97799999999999998]
["2021-03-17",0.94699999999999995]
["2021-03-18",0.92500000000000004]
["2021-03-19",0.89500000000000002]
["2021-03-20",0.86399999999999999]
["2021-03-21",0.84299999999999997]
["2021-03-22",0.80700000000000005]
["2021-03-23",0.78]
["2021-03-24",0.75700000000000001]
["2021-03-25",0.73699999999999999]
["2021-03-26",0.72099999999999997]
["2021-03-27",0.70399999999999996]
["2021-03-28",0.69699999999999995]
["2021-03-29",0.71399999999999997]
["2021-03-30",0.69]
["2021-03-31",0.65300000000000002]
["2021-04-01",0.622]
["2021-04-02",0.6]
["2021-04-03",0.57799999999999996]
["2021-04-04",0.56000000000000005]
["2021-04-05",0.59]
["2021-04-06",0.57099999999999995]
["2021-04-07",0.55200000000000005]
["2021-04-08"]
["2021-04-09",0.52600000000000002]
["2021-04-10",0.50900000000000001]
["2021-04-11",0.44900000000000001]
["2021-04-12",0.66600000000000004]
["2021-04-13",0.55900000000000005]
["2021-04-14",0.50600000000000001]
["2021-04-15",0.47199999999999998]
["2021-04-16",0.45100000000000001]
["2021-04-17",0.435]
["2021-04-18",0.42499999999999999]
["2021-04-19",0.41299999999999998]
["2021-04-20",0.39700000000000002]
["2021-04-21",0.379]
["2021-04-22",0.36099999999999999]
["2021-04-23",0.33300000000000002]
["2021-04-24",0.32100000000000001]
["2021-04-25",0.30499999999999999]
["2021-04-26",0.29499999999999998]
["2021-04-27",0.28699999999999998]
["2021-04-28",0.28199999999999997]
["2021-04-29",0.28799999999999998]
["2021-04-30",0.32]
["2021-05-01",0.29099999999999998]
["2021-05-02",0.28100000000000003]
["2021-05-03",0.3]
["2021-05-04",0.33]
["2021-05-05",0.42]
["2021-05-06",0.432]
["2021-05-07",0.41699999999999998]
["2021-05-08",0.41099999999999998]
["2021-05-09",0.44500000000000001]
["2021-05-10",0.438]
[{"$f":"A230+1","v":"2021-05-11"},0.40200000000000002]
["2021-05-12",0.38500000000000001]
["2021-05-13",0.41199999999999998]
["2021-05-14",0.40899999999999997]
["2021-05-15",0.39700000000000002]
["2021-05-16",0.39600000000000002]
["2021-05-17",0.38]
["2021-05-18",0.35199999999999998]
["2021-05-19",0.32600000000000001]
["2021-05-20",0.308]
["2021-05-21",0.29599999999999999]
["2021-05-22",0.28399999999999997]
["2021-05-23",0.28899999999999998]
["2021-05-24",0.26300000000000001]
["2021-05-25",0.30399999999999999]
["2021-05-26",0.30299999999999999]
["2021-05-27",0.28299999999999997]
["2021-05-28",0.28100000000000003]
["2021-05-29",0.26]
["2021-05-30",0.24399999999999999]
["2021-05-31",0.23300000000000001]
["2021-06-01"]
["2021-06-02"]
["2021-06-03"]
["2021-06-04"]
["2021-06-05"]
["2021-06-06"]
["2021-06-07"]
["2021-06-08"]
["2021-06-09"]
["2021-06-10"]
["2021-06-11"]
["2021-06-12"]
["2021-06-13"]
["2021-06-14"]
["2021-06-15"]
["2021-06-16"]
["2021-06-17"]
["2021-06-18"]
["2021-06-19"]
["2021-06-20"]
["2021-06-21"]
["2021-06-22"]
["2021-06-23"]
["2021-06-24"]
["2021-06-25"]
["2021-06-26"]
["2021-06-27"]
["2021-06-28"]
["2021-06-29"]
["2021-06-30"]
["2021-07-01"]
["2021-07-02"]
["2021-07-03"]
["2021-07-04"]
["2021-07-05"]
["2021-07-06"]
["2021-07-07"]
["2021-07-08"]
["2021-07-09"]
["2021-07-10"]
["2021-07-11"]
["2021-07-12"]
["2021-07-13"]
[{"$f":"A294+1","v":"2021-07-14"}]
["2021-07-15"]
["2021-07-16"]
["2021-07-17"]
["2021-07-18"]
["2021-07-19"]
["2021-07-20"]
["2021-07-21"]
["2021-07-22"]
["2021-07-23"]
["2021-07-24"]
["2021-07-25"]
["2021-07-26"]
["2021-07-27"]
["2021-07-28"]
["2021-07-29"]
["2021-07-30"]
["2021-07-31"]
["2021-08-01"]
["2021-08-02"]
["2021-08-03"]
["2021-08-04"]
["2021-08-05"]
["2021-08-06"]
["2021-08-07"]
["2021-08-08"]
["2021-08-09"]
["2021-08-10"]
["2021-08-11"]
["2021-08-12"]
["2021-08-13"]
["2021-08-14"]
["2021-08-15"]
["2021-08-16"]
["2021-08-17"]
["2021-08-18"]
["2021-08-19"]
["2021-08-20"]
["2021-08-21"]
["2021-08-22"]
["2021-08-23"]
["2021-08-24"]
["2021-08-25"]
["2021-08-26"]
["2021-08-27"]
["2021-08-28"]
["2021-08-29"]
["2021-08-30"]
["2021-08-31"]
["2021-09-01"]
["2021-09-02"]
["2021-09-03"]
["2021-09-04"]
["2021-09-05"]
["2021-09-06"]
["2021-09-07"]
["2021-09-08"]
["2021-09-09"]
["2021-09-10"]
["2021-09-11"]
["2021-09-12"]
["2021-09-13"]
["2021-09-14"]
["2021-09-15"]
[{"$f":"A358+1","v":"2021-09-16"}]
["2021-09-17"]
["2021-09-18"]
["2021-09-19"]
["2021-09-20"]
["2021-09-21"]
["2021-09-22"]
["2021-09-23"]
["2021-09-24"]
["2021-09-25"]
["2021-09-26"]
["2021-09-27"]
["2021-09-28"]
["2021-09-29"]
["2021-09-30"]
["2021-10-01"]
["2021-10-02"]
["2021-10-03"]
["2021-10-04"]
["2021-10-05"]
["2021-10-06"]
["2021-10-07"]
["2021-10-08"]
["2021-10-09"]
["2021-10-10"]
["2021-10-11"]
["2021-10-12"]
["2021-10-13"]
["2021-10-14"]
["2021-10-15"]
["2021-10-16"]
["2021-10-17"]
["2021-10-18"]
["2021-10-19"]
["2021-10-20"]
["2021-10-21"]
["2021-10-22"]
["2021-10-23"]
["2021-10-24"]
["2021-10-25"]
["2021-10-26"]
["2021-10-27"]
["2021-10-28"]
["2021-10-29"]
["2021-10-30"]
["2021-10-31"]
["2021-11-01"]
["2021-11-02"]
["2021-11-03"]
["2021-11-04"]
["2021-11-05"]
["2021-11-06"]
["2021-11-07"]
["2021-11-08"]
["2021-11-09"]
["2021-11-10"]
["2021-11-11"]
["2021-11-12"]
["2021-11-13"]
["2021-11-14"]
["2021-11-15"]
["2021-11-16"]
["2021-11-17"]
["2021-11-18"]
[{"$f":"A422+1","v":"2021-11-19"}]
["2021-11-20"]
["2021-11-21"]
["2021-11-22"]
["2021-11-23"]
["2021-11-24"]
["2021-11-25"]
["2021-11-26"]
["2021-11-27"]
["2021-11-28"]
["2021-11-29"]
["2021-11-30"]
["2021-12-01"]
["2021-12-02"]
["2021-12-03"]
["2021-12-04"]
["2021-12-05"]
["2021-12-06"]
["2021-12-07"]
["2021-12-08"]
["2021-12-09"]
["2021-12-10"]
["2021-12-11"]
["2021-12-12"]
["2021-12-13"]
["2021-12-14"]
["2021-12-15"]
["2021-12-16"]
["2021-12-17"]
["2021-12-18"]
["2021-12-19"]
["2021-12-20"]
["2021-12-21"]
["2021-12-22"]
["2021-12-23"]
["2021-12-24"]
["2021-12-25"]
["2021-12-26"]
["2021-12-27"]
["2021-12-28"]
["2021-12-29"]
["2021-12-30"]
["2021-12-31"]
["2022-01-01"]
["2022-01-02"]

{"sheet":"Statistik","index":6,"n_rows":81,"n_cols":93,"rows_kept":81,"cut":false,"hidden":false,"merged":[]}
[null,"Sege å, Vattenkontroll - Statistik"]
[]
[null,{"$f":"CONCATENATE(\"Statistik för åren: \",MIN(Q:Q),\" - \",MAX(Q:Q))","v":"Statistik för åren: 2011 - 2020"}]
[null,"(kan vara annorlunda för vissa parametrar)"]
[]
[null,null,null,null,null,null,null,null,null,null,null,null,null,null,null,null,null,null,null,null,null,null,null,null,null,null,"Stödlinjer i diagram-->",null,null,null,null,null,null,null,null,null,null,null,null,null,null,null,null,null,null,null,null,null,null,null,null,null,null,null,null,null,null,null,null,null,null,null,null,null,null,null,null,null,null,null,null,null,null,null,null,null,null,null,null,null,null,"Värden omvandlade för statisitk -->"]
[null,null,null,"  °C","mg/l","%",null,"  FNU","mS/m","mg/l"," µg/l"," µg/l","  µg/l","  µg/l","  µg/l",null,null,null,null,null,null,null,null,null,null,null,"Syre",null,null,null,"pH",null,null,null,"Turb",null,null,null,"Kond",null,null,"BOD",null,null,"PO4-P",null,null,"Tot_P",null,null,null,"NO2,3-N",null,null,"NH4-N",null,null,"Tot-N",null,null,null,null,null,null,null,null,null,null,null,null,null,null,null,null,null,null,null,null,null,null,null,"  °C","mg/l","%",null,"  FNU","mS/m","mg/l"," µg/l"," µg/l","  µg/l","  µg/l","  µg/l"]
[null,{"$f":"INDEX(Provpunkter!B1:B16,Provpunkter!G1)","v":"1  Sege å, vid Brännemölla, uppströms Svedala AR"},"Datum"," Temp"," Syrehalt","Syrem","  pH","Gruml","Kond","BOD7","PO4-P","Tot-P"," NO3+2-N","NH4-N"," Tot-N",null,"År","Månad",null,null,null,null,null,null,null,null,"Medel","+/- 1 std","- 1 std","Klass 4","Medel","+/- 1 std","- 1 std","Klass 3","Medel","+/- 1 std","- 1 std","Klass 5","Medel","+/- 1 std","- 1 std","Medel","+/- 1 std","- 1 std","Medel","+/- 1 std","- 1 std","Medel","+/- 1 std","- 1 std","Klass 5","Medel","+/- 1 std","- 1 std","Medel","+/- 1 std","- 1 std","Medel","+/- 1 std","- 1 std","Klass 5",null,null,"Test datum ",null,null,null,null,null,null,null,null,null,null,null,null,null,null,null,null,null," Temp"," Syrehalt","Syrem","  pH","Gruml","Kond","BOD","PO4-P","Tot-P"," NO3+2-N","NH4-N"," Tot-N"]
[{"$f":"IF(B9=B$8,1,\"\")","v":""},null,null,null,null,null,null,null,null,null,null,null,null,null,null,null,null,null,null,null,null,null,null,null,null,null,{"$f":"$E$73","v":9.6283333333333321},{"$f":"AA9+E$74","v":12.228404497070434},{"$f":"AA9-E$74","v":7.0282621695962302},2.95,{"$f":"$G$73","v":7.7374999999999998},{"$f":"AE9+G$74","v":7.980668526342102},{"$f":"AE9-G$74","v":7.4943314736578976},6.5,{"$f":"$H$73","v":34.543333333333337},{"$f":"AI9+H$74","v":107.50619216138078},{"$f":"AI9-H$74","v":-38.419525494714108},7,{"$f":"$I$73","v":43.528333333333343},{"$f":"AM9+I$74","v":49.689256983727617},{"$f":"AM9-I$74","v":37.367409682939069},{"$f":"$J$73","v":6.5305000000000009},{"$f":"AP9+J$74","v":8.1129679556024055},{"$f":"AP9-J$74","v":4.9480320443975963},{"$f":"$K$73","v":21.316666666666666},{"$f":"AS9+$K$74","v":25.224467065203196},{"$f":"AS9-$K$74","v":17.408866268130136},{"$f":"$L$73","v":108.18333333333334},{"$f":"AV9+$L$74","v":175.27888666465446},{"$f":"AV9-$L$74","v":41.087780002012209},100,{"$f":"$M$73","v":1820.8},{"$f":"AZ9+$M$74","v":4520.3602454185138},{"$f":"AZ9-$M$74","v":-878.76024541851416},{"$f":"$N$73","v":130.94999999999999},{"$f":"BC9+$N$74","v":305.17218670130114},{"$f":"BC9-$N$74","v":-43.272186701301194},{"$f":"$O$73","v":3911.6666666666665},{"$f":"BF9+$O$74","v":6215.980356666556},{"$f":"BF9-$O$74","v":1607.3529766667775},5000,null,null,{"$f":"C9","v":0},null,null,null,null,null,null,null,null,null,null,null,null,null,null,null,null,null,{"$f":"IF(D9=\"\",\"\",IF(OR(LEFT(D9,1)=\"<\",LEFT(D9,1)=\">\"),VALUE(MID(D9,2,3)),D9))","v":""},"","","","","","","","","","",""]
[null,"1  Sege å, vid Brännemölla, uppströms Svedala AR","2011-02-22",1.3,10.6,75.138706723078869,7.41,8.8000000000000007,39.799999999999997,5.8,21,61,1900,350,3400,"isfritt",2011,2,null,null,null,null,null,null,null,null,{"$f":"$E$73","v":9.6283333333333321},{"$f":"AA10+E$74","v":12.228404497070434},{"$f":"AA10-E$74","v":7.0282621695962302},2.95,{"$f":"$G$73","v":7.7374999999999998},{"$f":"AE10+G$74","v":7.980668526342102},{"$f":"AE10-G$74","v":7.4943314736578976},6.5,{"$f":"$H$73","v":34.543333333333337},{"$f":"AI10+H$74","v":107.50619216138078},{"$f":"AI10-H$74","v":-38.419525494714108},7,{"$f":"$I$73","v":43.528333333333343},{"$f":"AM10+I$74","v":49.689256983727617},{"$f":"AM10-I$74","v":37.367409682939069},{"$f":"$J$73","v":6.5305000000000009},{"$f":"AP10+J$74","v":8.1129679556024055},{"$f":"AP10-J$74","v":4.9480320443975963},{"$f":"$K$73","v":21.316666666666666},{"$f":"AS10+$K$74","v":25.224467065203196},{"$f":"AS10-$K$74","v":17.408866268130136},{"$f":"$L$73","v":108.18333333333334},{"$f":"AV10+$L$74","v":175.27888666465446},{"$f":"AV10-$L$74","v":41.087780002012209},100,{"$f":"$M$73","v":1820.8},{"$f":"AZ10+$M$74","v":4520.3602454185138},{"$f":"AZ10-$M$74","v":-878.76024541851416},{"$f":"$N$73","v":130.94999999999999},{"$f":"BC10+$N$74","v":305.17218670130114},{"$f":"BC10-$N$74","v":-43.272186701301194},{"$f":"$O$73","v":3911.6666666666665},{"$f":"BF10+$O$74","v":6215.980356666556},{"$f":"BF10-$O$74","v":1607.3529766667775},5000,null,null,{"$f":"C10","v":40596},null,null,null,null,null,null,null,null,null,null,null,null,null,null,null,null,null,{"$f":"IF(D10=\"\",\"\",IF(OR(LEFT(D10,1)=\"<\",LEFT(D10,1)=\">\"),VALUE(MID(D10,2,3)),D10))","v":1.3},{"$f":"IF(E10=\"\",\"\",IF(OR(LEFT(E10,1)=\"<\",LEFT(E10,1)=\">\"),VALUE(MID(E10,2,3)),E10))","v":10.6},{"$f":"IF(F10=\"\",\"\",IF(OR(LEFT(F10,1)=\"<\",LEFT(F10,1)=\">\"),VALUE(MID(F10,2,3)),F10))","v":75.138706723078869},{"$f":"IF(G10=\"\",\"\",IF(OR(LEFT(G10,1)=\"<\",LEFT(G10,1)=\">\"),VALUE(MID(G10,2,3)),G10))","v":7.41},{"$f":"IF(H10=\"\",\"\",IF(OR(LEFT(H10,1)=\"<\",LEFT(H10,1)=\">\"),VALUE(MID(H10,2,3)),H10))","v":8.8000000000000007},{"$f":"IF(I10=\"\",\"\",IF(OR(LEFT(I10,1)=\"<\",LEFT(I10,1)=\">\"),VALUE(MID(I10,2,3)),I10))","v":39.799999999999997},{"$f":"IF(J10=\"\",\"\",IF(OR(LEFT(J10,1)=\"<\",LEFT(J10,1)=\">\"),VALUE(MID(J10,2,3)),J10))","v":5.8},{"$f":"IF(K10=\"\",\"\",IF(OR(LEFT(K10,1)=\"<\",LEFT(K10,1)=\">\"),VALUE(MID(K10,2,3)),K10))","v":21},{"$f":"IF(L10=\"\",\"\",IF(OR(LEFT(L10,1)=\"<\",LEFT(L10,1)=\">\"),VALUE(MID(L10,2,3)),L10))","v":61},{"$f":"IF(M10=\"\",\"\",IF(OR(LEFT(M10,1)=\"<\",LEFT(M10,1)=\">\"),VALUE(MID(M10,2,3)),M10))","v":1900},{"$f":"IF(N10=\"\",\"\",IF(OR(LEFT(N10,1)=\"<\",LEFT(N10,1)=\">\"),VALUE(MID(N10,2,3)),N10))","v":350},{"$f":"IF(O10=\"\",\"\",IF(OR(LEFT(O10,1)=\"<\",LEFT(O10,1)=\">\"),VALUE(MID(O10,2,3)),O10))","v":3400}]
[null,"1  Sege å, vid Brännemölla, uppströms Svedala AR","2011-04-11",10.5,11.6,104.33957292161482,8.18,19,39.799999999999997,9.8000000000000007,22,120,940,72,3100,"gröngrumligt",2011,4,null,null,null,null,null,null,null,null,9.6283333333333321,12.228404497070434,7.0282621695962302,2.95,7.7374999999999998,7.980668526342102,7.4943314736578976,6.5,34.543333333333337,107.50619216138078,-38.419525494714108,7,43.528333333333343,49.689256983727617,37.367409682939069,6.5305000000000009,8.1129679556024055,4.9480320443975963,21.316666666666666,25.224467065203196,17.408866268130136,108.18333333333334,175.27888666465446,41.087780002012209,100,1820.8,4520.3602454185138,-878.76024541851416,130.94999999999999,305.17218670130114,-43.272186701301194,3911.6666666666665,6215.980356666556,1607.3529766667775,5000,null,null,40644,null,null,null,null,null,null,null,null,null,null,null,null,null,null,null,null,null,10.5,11.6,104.33957292161482,8.18,19,39.799999999999997,9.8000000000000007,22,120,940,72,3100]
[null,"1  Sege å, vid Brännemölla, uppströms Svedala AR","2011-06-21",18.5,10.8,115.34095101047319,8.6999999999999993,41,32.5,7.8,32,170,58,"<10",3700,"lågflöde, grumligt",2011,6,null,null,null,null,null,null,null,null,9.6283333333333321,12.228404497070434,7.0282621695962302,2.95,7.7374999999999998,7.980668526342102,7.4943314736578976,6.5,34.543333333333337,107.50619216138078,-38.419525494714108,7,43.528333333333343,49.689256983727617,37.367409682939069,6.5305000000000009,8.1129679556024055,4.9480320443975963,21.316666666666666,25.224467065203196,17.408866268130136,108.18333333333334,175.27888666465446,41.087780002012209,100,1820.8,4520.3602454185138,-878.76024541851416,130.94999999999999,305.17218670130114,-43.272186701301194,3911.6666666666665,6215.980356666556,1607.3529766667775,5000,null,null,40715,null,null,null,null,null,null,null,null,null,null,null,null,null,null,null,null,null,18.5,10.8,115.34095101047319,8.6999999999999993,41,32.5,7.8,32,170,58,10,3700]
[null,"1  Sege å, vid Brännemölla, uppströms Svedala AR","2011-08-16",16.399999999999999,7.6,77.836862481435361,7.36,25,40,5.8,31,140,1400,"<10",4000,"högflöde, grumligt",2011,8,null,null,null,null,null,null,null,null,9.6283333333333321,12.228404497070434,7.0282621695962302,2.95,7.7374999999999998,7.980668526342102,7.4943314736578976,6.5,34.543333333333337,107.50619216138078,-38.419525494714108,7,43.528333333333343,49.689256983727617,37.367409682939069,6.5305000000000009,8.1129679556024055,4.9480320443975963,21.316666666666666,25.224467065203196,17.408866268130136,108.18333333333334,175.27888666465446,41.087780002012209,100,1820.8,4520.3602454185138,-878.76024541851416,130.94999999999999,305.17218670130114,-43.272186701301194,3911.6666666666665,6215.980356666556,1607.3529766667775,5000,null,null,40771,null,null,null,null,null,null,null,null,null,null,null,null,null,null,null,null,null,16.399999999999999,7.6,77.836862481435361,7.36,25,40,5.8,31,140,1400,10,4000]
[null,"1  Sege å, vid Brännemölla, uppströms Svedala AR","2011-10-11",11,8.8000000000000007,80.085800496409462,7.49,17,45.1,6.8,31,99,1200,240,3400,"gröngrumligt",2011,10,null,null,null,null,null,null,null,null,9.6283333333333321,12.228404497070434,7.0282621695962302,2.95,7.7374999999999998,7.980668526342102,7.4943314736578976,6.5,34.543333333333337,107.50619216138078,-38.419525494714108,7,43.528333333333343,49.689256983727617,37.367409682939069,6.5305000000000009,8.1129679556024055,4.9480320443975963,21.316666666666666,25.224467065203196,17.408866268130136,108.18333333333334,175.27888666465446,41.087780002012209,100,1820.8,4520.3602454185138,-878.76024541851416,130.94999999999999,305.17218670130114,-43.272186701301194,3911.6666666666665,6215.980356666556,1607.3529766667775,5000,null,null,40827,null,null,null,null,null,null,null,null,null,null,null,null,null,null,null,null,null,11,8.8000000000000007,80.085800496409462,7.49,17,45.1,6.8,31,99,1200,240,3400]
[null,"1  Sege å, vid Brännemölla, uppströms Svedala AR","2011-12-19",2.6,11.9,87.467087408850958,7.7,34,45.4,6.2,21,120,1500,770,4200,"gröngrumligt",2011,12,null,null,null,null,null,null,null,null,9.6283333333333321,12.228404497070434,7.0282621695962302,2.95,7.7374999999999998,7.980668526342102,7.4943314736578976,6.5,34.543333333333337,107.50619216138078,-38.419525494714108,7,43.528333333333343,49.689256983727617,37.367409682939069,6.5305000000000009,8.1129679556024055,4.9480320443975963,21.316666666666666,25.224467065203196,17.408866268130136,108.18333333333334,175.27888666465446,41.087780002012209,100,1820.8,4520.3602454185138,-878.76024541851416,130.94999999999999,305.17218670130114,-43.272186701301194,3911.6666666666665,6215.980356666556,1607.3529766667775,5000,null,null,40896,null,null,null,null,null,null,null,null,null,null,null,null,null,null,null,null,null,2.6,11.9,87.467087408850958,7.7,34,45.4,6.2,21,120,1500,770,4200]
[null,"1  Sege å, vid Brännemölla, uppströms Svedala AR","2012-02-13",1.2,12.3,86.943529489523584,7.5,13,46,6.6,21,58,1600,700,3600,"is i kanten",2012,2,null,null,null,null,null,null,null,null,9.6283333333333321,12.228404497070434,7.0282621695962302,2.95,7.7374999999999998,7.980668526342102,7.4943314736578976,6.5,34.543333333333337,107.50619216138078,-38.419525494714108,7,43.528333333333343,49.689256983727617,37.367409682939069,6.5305000000000009,8.1129679556024055,4.9480320443975963,21.316666666666666,25.224467065203196,17.408866268130136,108.18333333333334,175.27888666465446,41.087780002012209,100,1820.8,4520.3602454185138,-878.76024541851416,130.94999999999999,305.17218670130114,-43.272186701301194,3911.6666666666665,6215.980356666556,1607.3529766667775,5000,null,null,40952,null,null,null,null,null,null,null,null,null,null,null,null,null,null,null,null,null,1.2,12.3,86.943529489523584,7.5,13,46,6.6,21,58,1600,700,3600]
[null,"1  Sege å, vid Brännemölla, uppströms Svedala AR","2012-04-16",8,10.9,92.292424411882706,7.97,7.3,43,6.05,20,54,990,230,2700,"gröngrumligt",2012,4,null,null,null,null,null,null,null,null,9.6283333333333321,12.228404497070434,7.0282621695962302,2.95,7.7374999999999998,7.980668526342102,7.4943314736578976,6.5,34.543333333333337,107.50619216138078,-38.419525494714108,7,43.528333333333343,49.689256983727617,37.367409682939069,6.5305000000000009,8.1129679556024055,4.9480320443975963,21.316666666666666,25.224467065203196,17.408866268130136,108.18333333333334,175.27888666465446,41.087780002012209,100,1820.8,4520.3602454185138,-878.76024541851416,130.94999999999999,305.17218670130114,-43.272186701301194,3911.6666666666665,6215.980356666556,1607.3529766667775,5000,null,null,41015,null,null,null,null,null,null,null,null,null,null,null,null,null,null,null,null,null,8,10.9,92.292424411882706,7.97,7.3,43,6.05,20,54,990,230,2700]
[null,"1  Sege å, vid Brännemölla, uppströms Svedala AR","2012-06-19",17.5,7.9,82.727109284405657,7.9,32,41.2,7,17,130,180,"<10",2800,"grumligt",2012,6,null,null,null,null,null,null,null,null,9.6283333333333321,12.228404497070434,7.0282621695962302,2.95,7.7374999999999998,7.980668526342102,7.4943314736578976,6.5,34.543333333333337,107.50619216138078,-38.419525494714108,7,43.528333333333343,49.689256983727617,37.367409682939069,6.5305000000000009,8.1129679556024055,4.9480320443975963,21.316666666666666,25.224467065203196,17.408866268130136,108.18333333333334,175.27888666465446,41.087780002012209,100,1820.8,4520.3602454185138,-878.76024541851416,130.94999999999999,305.17218670130114,-43.272186701301194,3911.6666666666665,6215.980356666556,1607.3529766667775,5000,null,null,41079,null,null,null,null,null,null,null,null,null,null,null,null,null,null,null,null,null,17.5,7.9,82.727109284405657,7.9,32,41.2,7,17,130,180,10,2800]
[null,"1  Sege å, vid Brännemölla, uppströms Svedala AR","2012-08-20",21.1,6.6,74.007896950048774,7.82,23,38.200000000000003,7.6,26,130,530,"<10",2300,"grumligt",2012,8,null,null,null,null,null,null,null,null,9.6283333333333321,12.228404497070434,7.0282621695962302,2.95,7.7374999999999998,7.980668526342102,7.4943314736578976,6.5,34.543333333333337,107.50619216138078,-38.419525494714108,7,43.528333333333343,49.689256983727617,37.367409682939069,6.5305000000000009,8.1129679556024055,4.9480320443975963,21.316666666666666,25.224467065203196,17.408866268130136,108.18333333333334,175.27888666465446,41.087780002012209,100,1820.8,4520.3602454185138,-878.76024541851416,130.94999999999999,305.17218670130114,-43.272186701301194,3911.6666666666665,6215.980356666556,1607.3529766667775,5000,null,null,41141,null,null,null,null,null,null,null,null,null,null,null,null,null,null,null,null,null,21.1,6.6,74.007896950048774,7.82,23,38.200000000000003,7.6,26,130,530,10,2300]
[null,"1  Sege å, vid Brännemölla, uppströms Svedala AR","2012-10-10",8.5,10.199999999999999,87.438386998784694,7.87,21,44.4,6.9,17,110,820,"<10",2700,"gröngrumligt",2012,10,null,null,null,null,null,null,null,null,9.6283333333333321,12.228404497070434,7.0282621695962302,2.95,7.7374999999999998,7.980668526342102,7.4943314736578976,6.5,34.543333333333337,107.50619216138078,-38.419525494714108,7,43.528333333333343,49.689256983727617,37.367409682939069,6.5305000000000009,8.1129679556024055,4.9480320443975963,21.316666666666666,25.224467065203196,17.408866268130136,108.18333333333334,175.27888666465446,41.087780002012209,100,1820.8,4520.3602454185138,-878.76024541851416,130.94999999999999,305.17218670130114,-43.272186701301194,3911.6666666666665,6215.980356666556,1607.3529766667775,5000,null,null,41192,null,null,null,null,null,null,null,null,null,null,null,null,null,null,null,null,null,8.5,10.199999999999999,87.438386998784694,7.87,21,44.4,6.9,17,110,820,10,2700]
[null,"1  Sege å, vid Brännemölla, uppströms Svedala AR","2012-12-10",0.7,13.5,94.081807720653757,7.84,13,43.2,6.2,20,73,550,320,2800,"isfritt",2012,12,null,null,null,null,null,null,null,null,9.6283333333333321,12.228404497070434,7.0282621695962302,2.95,7.7374999999999998,7.980668526342102,7.4943314736578976,6.5,34.543333333333337,107.50619216138078,-38.419525494714108,7,43.528333333333343,49.689256983727617,37.367409682939069,6.5305000000000009,8.1129679556024055,4.9480320443975963,21.316666666666666,25.224467065203196,17.408866268130136,108.18333333333334,175.27888666465446,41.087780002012209,100,1820.8,4520.3602454185138,-878.76024541851416,130.94999999999999,305.17218670130114,-43.272186701301194,3911.6666666666665,6215.980356666556,1607.3529766667775,5000,null,null,41253,null,null,null,null,null,null,null,null,null,null,null,null,null,null,null,null,null,0.7,13.5,94.081807720653757,7.84,13,43.2,6.2,20,73,550,320,2800]
[null,"1  Sege å, vid Brännemölla, uppströms Svedala AR","2013-02-18",1.3,12.2,86.480398303920964,7.6,7.5,42.2,2.6,17,36,2400,310,3800,"grumligt",2013,2,null,null,null,null,null,null,null,null,9.6283333333333321,12.228404497070434,7.0282621695962302,2.95,7.7374999999999998,7.980668526342102,7.4943314736578976,6.5,34.543333333333337,107.50619216138078,-38.419525494714108,7,43.528333333333343,49.689256983727617,37.367409682939069,6.5305000000000009,8.1129679556024055,4.9480320443975963,21.316666666666666,25.224467065203196,17.408866268130136,108.18333333333334,175.27888666465446,41.087780002012209,100,1820.8,4520.3602454185138,-878.76024541851416,130.94999999999999,305.17218670130114,-43.272186701301194,3911.6666666666665,6215.980356666556,1607.3529766667775,5000,null,null,41323,null,null,null,null,null,null,null,null,null,null,null,null,null,null,null,null,null,1.3,12.2,86.480398303920964,7.6,7.5,42.2,2.6,17,36,2400,310,3800]
[null,"1  Sege å, vid Brännemölla, uppströms Svedala AR","2013-04-15",8.8000000000000007,13.4,115.71704939600069,8,8.8000000000000007,43,5.7,17,44,1000,450,2800,null,2013,4,null,null,null,null,null,null,null,null,9.6283333333333321,12.228404497070434,7.0282621695962302,2.95,7.7374999999999998,7.980668526342102,7.4943314736578976,6.5,34.543333333333337,107.50619216138078,-38.419525494714108,7,43.528333333333343,49.689256983727617,37.367409682939069,6.5305000000000009,8.1129679556024055,4.9480320443975963,21.316666666666666,25.224467065203196,17.408866268130136,108.18333333333334,175.27888666465446,41.087780002012209,100,1820.8,4520.3602454185138,-878.76024541851416,130.94999999999999,305.17218670130114,-43.272186701301194,3911.6666666666665,6215.980356666556,1607.3529766667775,5000,null,null,41379,null,null,null,null,null,null,null,null,null,null,null,null,null,null,null,null,null,8.8000000000000007,13.4,115.71704939600069,8,8.8000000000000007,43,5.7,17,44,1000,450,2800]
[null,"1  Sege å, vid Brännemölla, uppströms Svedala AR","2013-06-17",19.2,10.1,109.32695993424065,7.8,34,40.6,8.33,22,130,140,"<10",2600,"gröngrumligt",2013,6,null,null,null,null,null,null,null,null,9.6283333333333321,12.228404497070434,7.0282621695962302,2.95,7.7374999999999998,7.980668526342102,7.4943314736578976,6.5,34.543333333333337,107.50619216138078,-38.419525494714108,7,43.528333333333343,49.689256983727617,37.367409682939069,6.5305000000000009,8.1129679556024055,4.9480320443975963,21.316666666666666,25.224467065203196,17.408866268130136,108.18333333333334,175.27888666465446,41.087780002012209,100,1820.8,4520.3602454185138,-878.76024541851416,130.94999999999999,305.17218670130114,-43.272186701301194,3911.6666666666665,6215.980356666556,1607.3529766667775,5000,null,null,41442,null,null,null,null,null,null,null,null,null,null,null,null,null,null,null,null,null,19.2,10.1,109.32695993424065,7.8,34,40.6,8.33,22,130,140,10,2600]
[null,"1  Sege å, vid Brännemölla, uppströms Svedala AR","2013-08-20",16.399999999999999,7.6,77.836862481435361,7.5,19,36.799999999999997,8.4,17,150,280,17,2900,"gröngrumligt",2013,8,null,null,null,null,null,null,null,null,9.6283333333333321,12.228404497070434,7.0282621695962302,2.95,7.7374999999999998,7.980668526342102,7.4943314736578976,6.5,34.543333333333337,107.50619216138078,-38.419525494714108,7,43.528333333333343,49.689256983727617,37.367409682939069,6.5305000000000009,8.1129679556024055,4.9480320443975963,21.316666666666666,25.224467065203196,17.408866268130136,108.18333333333334,175.27888666465446,41.087780002012209,100,1820.8,4520.3602454185138,-878.76024541851416,130.94999999999999,305.17218670130114,-43.272186701301194,3911.6666666666665,6215.980356666556,1607.3529766667775,5000,null,null,41506,null,null,null,null,null,null,null,null,null,null,null,null,null,null,null,null,null,16.399999999999999,7.6,77.836862481435361,7.5,19,36.799999999999997,8.4,17,150,280,17,2900]
[null,"1  Sege å, vid Brännemölla, uppströms Svedala AR","2013-10-14",12.1,7.5,70.002873846340592,7.49,22,40.4,9,21,210,380,"<10",4400,"gröngrumligt",2013,10,null,null,null,null,null,null,null,null,9.6283333333333321,12.228404497070434,7.0282621695962302,2.95,7.7374999999999998,7.980668526342102,7.4943314736578976,6.5,34.543333333333337,107.50619216138078,-38.419525494714108,7,43.528333333333343,49.689256983727617,37.367409682939069,6.5305000000000009,8.1129679556024055,4.9480320443975963,21.316666666666666,25.224467065203196,17.408866268130136,108.18333333333334,175.27888666465446,41.087780002012209,100,1820.8,4520.3602454185138,-878.76024541851416,130.94999999999999,305.17218670130114,-43.272186701301194,3911.6666666666665,6215.980356666556,1607.3529766667775,5000,null,null,41561,null,null,null,null,null,null,null,null,null,null,null,null,null,null,null,null,null,12.1,7.5,70.002873846340592,7.49,22,40.4,9,21,210,380,10,4400]
[null,"1  Sege å, vid Brännemölla, uppströms Svedala AR","2013-12-12",4.7,12.4,96.46611715591618,7.58,25,52.6,4.2,20,96,7800,110,8000,"gröngrumligt",2013,12,null,null,null,null,null,null,null,null,9.6283333333333321,12.228404497070434,7.0282621695962302,2.95,7.7374999999999998,7.980668526342102,7.4943314736578976,6.5,34.543333333333337,107.50619216138078,-38.419525494714108,7,43.528333333333343,49.689256983727617,37.367409682939069,6.5305000000000009,8.1129679556024055,4.9480320443975963,21.316666666666666,25.224467065203196,17.408866268130136,108.18333333333334,175.27888666465446,41.087780002012209,100,1820.8,4520.3602454185138,-878.76024541851416,130.94999999999999,305.17218670130114,-43.272186701301194,3911.6666666666665,6215.980356666556,1607.3529766667775,5000,null,null,41620,null,null,null,null,null,null,null,null,null,null,null,null,null,null,null,null,null,4.7,12.4,96.46611715591618,7.58,25,52.6,4.2,20,96,7800,110,8000]
[null,"1  Sege å, vid Brännemölla, uppströms Svedala AR","2014-02-18",2.9,12.2,90.414544369343773,7.83,20,42.1,4.9000000000000004,15,89,2400,420,4200,"Högflöde",2014,2,null,null,null,null,null,null,null,null,9.6283333333333321,12.228404497070434,7.0282621695962302,2.95,7.7374999999999998,7.980668526342102,7.4943314736578976,6.5,34.543333333333337,107.50619216138078,-38.419525494714108,7,43.528333333333343,49.689256983727617,37.367409682939069,6.5305000000000009,8.1129679556024055,4.9480320443975963,21.316666666666666,25.224467065203196,17.408866268130136,108.18333333333334,175.27888666465446,41.087780002012209,100,1820.8,4520.3602454185138,-878.76024541851416,130.94999999999999,305.17218670130114,-43.272186701301194,3911.6666666666665,6215.980356666556,1607.3529766667775,5000,null,null,41688,null,null,null,null,null,null,null,null,null,null,null,null,null,null,null,null,null,2.9,12.2,90.414544369343773,7.83,20,42.1,4.9000000000000004,15,89,2400,420,4200]
[null,"1  Sege å, vid Brännemölla, uppströms Svedala AR","2014-04-14",8.6999999999999993,11,94.759759336082269,8.15,18,42.9,7.2,20,62,1300,"<10",3000,"Måttligt flöde",2014,4,null,null,null,null,null,null,null,null,9.6283333333333321,12.228404497070434,7.0282621695962302,2.95,7.7374999999999998,7.980668526342102,7.4943314736578976,6.5,34.543333333333337,107.50619216138078,-38.419525494714108,7,43.528333333333343,49.689256983727617,37.367409682939069,6.5305000000000009,8.1129679556024055,4.9480320443975963,21.316666666666666,25.224467065203196,17.408866268130136,108.18333333333334,175.27888666465446,41.087780002012209,100,1820.8,4520.3602454185138,-878.76024541851416,130.94999999999999,305.17218670130114,-43.272186701301194,3911.6666666666665,6215.980356666556,1607.3529766667775,5000,null,null,41743,null,null,null,null,null,null,null,null,null,null,null,null,null,null,null,null,null,8.6999999999999993,11,94.759759336082269,8.15,18,42.9,7.2,20,62,1300,10,3000]
[null,"1  Sege å, vid Brännemölla, uppströms Svedala AR","2014-06-11",18.100000000000001,4.7,49.80449554212629,7.63,19,41.7,7.5,17,23,660,220,3300,"Grumligt",2014,6,null,null,null,null,null,null,null,null,9.6283333333333321,12.228404497070434,7.0282621695962302,2.95,7.7374999999999998,7.980668526342102,7.4943314736578976,6.5,34.543333333333337,107.50619216138078,-38.419525494714108,7,43.528333333333343,49.689256983727617,37.367409682939069,6.5305000000000009,8.1129679556024055,4.9480320443975963,21.316666666666666,25.224467065203196,17.408866268130136,108.18333333333334,175.27888666465446,41.087780002012209,100,1820.8,4520.3602454185138,-878.76024541851416,130.94999999999999,305.17218670130114,-43.272186701301194,3911.6666666666665,6215.980356666556,1607.3529766667775,5000,null,null,41801,null,null,null,null,null,null,null,null,null,null,null,null,null,null,null,null,null,18.100000000000001,4.7,49.80449554212629,7.63,19,41.7,7.5,17,23,660,220,3300]
[null,"1  Sege å, vid Brännemölla, uppströms Svedala AR","2014-08-18",15.1,7.3,72.768475809552925,7.53,17,40.4,7.7,22,160,420,47,3000,"Gröngrumligt",2014,8,null,null,null,null,null,null,null,null,9.6283333333333321,12.228404497070434,7.0282621695962302,2.95,7.7374999999999998,7.980668526342102,7.4943314736578976,6.5,34.543333333333337,107.50619216138078,-38.419525494714108,7,43.528333333333343,49.689256983727617,37.367409682939069,6.5305000000000009,8.1129679556024055,4.9480320443975963,21.316666666666666,25.224467065203196,17.408866268130136,108.18333333333334,175.27888666465446,41.087780002012209,100,1820.8,4520.3602454185138,-878.76024541851416,130.94999999999999,305.17218670130114,-43.272186701301194,3911.6666666666665,6215.980356666556,1607.3529766667775,5000,null,null,41869,null,null,null,null,null,null,null,null,null,null,null,null,null,null,null,null,null,15.1,7.3,72.768475809552925,7.53,17,40.4,7.7,22,160,420,47,3000]
[null,"1  Sege å, vid Brännemölla, uppströms Svedala AR","2014-10-20",13,6.3,60.00362747295582,7.13,184,41.9,4.0999999999999996,21,46,6900,48,8100,"Högflöde, grumligt",2014,10,null,null,null,null,null,null,null,null,9.6283333333333321,12.228404497070434,7.0282621695962302,2.95,7.7374999999999998,7.980668526342102,7.4943314736578976,6.5,34.543333333333337,107.50619216138078,-38.419525494714108,7,43.528333333333343,49.689256983727617,37.367409682939069,6.5305000000000009,8.1129679556024055,4.9480320443975963,21.316666666666666,25.224467065203196,17.408866268130136,108.18333333333334,175.27888666465446,41.087780002012209,100,1820.8,4520.3602454185138,-878.76024541851416,130.94999999999999,305.17218670130114,-43.272186701301194,3911.6666666666665,6215.980356666556,1607.3529766667775,5000,null,null,41932,null,null,null,null,null,null,null,null,null,null,null,null,null,null,null,null,null,13,6.3,60.00362747295582,7.13,184,41.9,4.0999999999999996,21,46,6900,48,8100]
[null,"1  Sege å, vid Brännemölla, uppströms Svedala AR","2014-12-10",4.0999999999999996,10.9,83.451308024374825,7.62,520,40.200000000000003,6.3,25,440,1900,410,4200,"Mkt lergumligt",2014,12,null,null,null,null,null,null,null,null,9.6283333333333321,12.228404497070434,7.0282621695962302,2.95,7.7374999999999998,7.980668526342102,7.4943314736578976,6.5,34.543333333333337,107.50619216138078,-38.419525494714108,7,43.528333333333343,49.689256983727617,37.367409682939069,6.5305000000000009,8.1129679556024055,4.9480320443975963,21.316666666666666,25.224467065203196,17.408866268130136,108.18333333333334,175.27888666465446,41.087780002012209,100,1820.8,4520.3602454185138,-878.76024541851416,130.94999999999999,305.17218670130114,-43.272186701301194,3911.6666666666665,6215.980356666556,1607.3529766667775,5000,null,null,41983,null,null,null,null,null,null,null,null,null,null,null,null,null,null,null,null,null,4.0999999999999996,10.9,83.451308024374825,7.62,520,40.200000000000003,6.3,25,440,1900,410,4200]
[null,"1  Sege å, vid Brännemölla, uppströms Svedala AR","2015-02-10",2.2999999999999998,12.7,92.57661156981348,7.79,25,41,5.8,18,71,1700,480,3900,"grumligt",2015,2,null,null,null,null,null,null,null,null,9.6283333333333321,12.228404497070434,7.0282621695962302,2.95,7.7374999999999998,7.980668526342102,7.4943314736578976,6.5,34.543333333333337,107.50619216138078,-38.419525494714108,7,43.528333333333343,49.689256983727617,37.367409682939069,6.5305000000000009,8.1129679556024055,4.9480320443975963,21.316666666666666,25.224467065203196,17.408866268130136,108.18333333333334,175.27888666465446,41.087780002012209,100,1820.8,4520.3602454185138,-878.76024541851416,130.94999999999999,305.17218670130114,-43.272186701301194,3911.6666666666665,6215.980356666556,1607.3529766667775,5000,null,null,42045,null,null,null,null,null,null,null,null,null,null,null,null,null,null,null,null,null,2.2999999999999998,12.7,92.57661156981348,7.79,25,41,5.8,18,71,1700,480,3900]
[null,"1  Sege å, vid Brännemölla, uppströms Svedala AR","2015-04-13",9.6,11.5,101.25115115884853,8.07,15,42.5,5.8,21,66,1700,"<10",3300,"grumligt",2015,4,null,null,null,null,null,null,null,null,9.6283333333333321,12.228404497070434,7.0282621695962302,2.95,7.7374999999999998,7.980668526342102,7.4943314736578976,6.5,34.543333333333337,107.50619216138078,-38.419525494714108,7,43.528333333333343,49.689256983727617,37.367409682939069,6.5305000000000009,8.1129679556024055,4.9480320443975963,21.316666666666666,25.224467065203196,17.408866268130136,108.18333333333334,175.27888666465446,41.087780002012209,100,1820.8,4520.3602454185138,-878.76024541851416,130.94999999999999,305.17218670130114,-43.272186701301194,3911.6666666666665,6215.980356666556,1607.3529766667775,5000,null,null,42107,null,null,null,null,null,null,null,null,null,null,null,null,null,null,null,null,null,9.6,11.5,101.25115115884853,8.07,15,42.5,5.8,21,66,1700,10,3300]
[null,"1  Sege å, vid Brännemölla, uppströms Svedala AR","2015-06-15",16.100000000000001,5.7,58.018736529197959,7.54,17,44.5,8.6,21,160,450,220,3300,"gröngrumligt",2015,6,null,null,null,null,null,null,null,null,9.6283333333333321,12.228404497070434,7.0282621695962302,2.95,7.7374999999999998,7.980668526342102,7.4943314736578976,6.5,34.543333333333337,107.50619216138078,-38.419525494714108,7,43.528333333333343,49.689256983727617,37.367409682939069,6.5305000000000009,8.1129679556024055,4.9480320443975963,21.316666666666666,25.224467065203196,17.408866268130136,108.18333333333334,175.27888666465446,41.087780002012209,100,1820.8,4520.3602454185138,-878.76024541851416,130.94999999999999,305.17218670130114,-43.272186701301194,3911.6666666666665,6215.980356666556,1607.3529766667775,5000,null,null,42170,null,null,null,null,null,null,null,null,null,null,null,null,null,null,null,null,null,16.100000000000001,5.7,58.018736529197959,7.54,17,44.5,8.6,21,160,450,220,3300]
[null,"1  Sege å, vid Brännemölla, uppströms Svedala AR","2015-08-18",17.8,5.2,54.778360041394457,7.58,34,40.700000000000003,8.1,28,240,410,"<10",3700,"grumligt",2015,8,null,null,null,null,null,null,null,null,9.6283333333333321,12.228404497070434,7.0282621695962302,2.95,7.7374999999999998,7.980668526342102,7.4943314736578976,6.5,34.543333333333337,107.50619216138078,-38.419525494714108,7,43.528333333333343,49.689256983727617,37.367409682939069,6.5305000000000009,8.1129679556024055,4.9480320443975963,21.316666666666666,25.224467065203196,17.408866268130136,108.18333333333334,175.27888666465446,41.087780002012209,100,1820.8,4520.3602454185138,-878.76024541851416,130.94999999999999,305.17218670130114,-43.272186701301194,3911.6666666666665,6215.980356666556,1607.3529766667775,5000,null,null,42234,null,null,null,null,null,null,null,null,null,null,null,null,null,null,null,null,null,17.8,5.2,54.778360041394457,7.58,34,40.700000000000003,8.1,28,240,410,10,3700]
[null,"1  Sege å, vid Brännemölla, uppströms Svedala AR","2015-10-19",9.5,8.9,78.171562764143133,7.65,25,41.9,6.2,19,120,430,19,2900,"grumligt",2015,10,null,null,null,null,null,null,null,null,9.6283333333333321,12.228404497070434,7.0282621695962302,2.95,7.7374999999999998,7.980668526342102,7.4943314736578976,6.5,34.543333333333337,107.50619216138078,-38.419525494714108,7,43.528333333333343,49.689256983727617,37.367409682939069,6.5305000000000009,8.1129679556024055,4.9480320443975963,21.316666666666666,25.224467065203196,17.408866268130136,108.18333333333334,175.27888666465446,41.087780002012209,100,1820.8,4520.3602454185138,-878.76024541851416,130.94999999999999,305.17218670130114,-43.272186701301194,3911.6666666666665,6215.980356666556,1607.3529766667775,5000,null,null,42296,null,null,null,null,null,null,null,null,null,null,null,null,null,null,null,null,null,9.5,8.9,78.171562764143133,7.65,25,41.9,6.2,19,120,430,19,2900]
[null,"1  Sege å, vid Brännemölla, uppströms Svedala AR","2015-12-09",6,11,88.537098609352142,7.8,25,41.9,5.4,20,110,2200,22,4000,"grumligt",2015,12,null,null,null,null,null,null,null,null,9.6283333333333321,12.228404497070434,7.0282621695962302,2.95,7.7374999999999998,7.980668526342102,7.4943314736578976,6.5,34.543333333333337,107.50619216138078,-38.419525494714108,7,43.528333333333343,49.689256983727617,37.367409682939069,6.5305000000000009,8.1129679556024055,4.9480320443975963,21.316666666666666,25.224467065203196,17.408866268130136,108.18333333333334,175.27888666465446,41.087780002012209,100,1820.8,4520.3602454185138,-878.76024541851416,130.94999999999999,305.17218670130114,-43.272186701301194,3911.6666666666665,6215.980356666556,1607.3529766667775,5000,null,null,42347,null,null,null,null,null,null,null,null,null,null,null,null,null,null,null,null,null,6,11,88.537098609352142,7.8,25,41.9,5.4,20,110,2200,22,4000]
[null,"1  Sege å, vid Brännemölla, uppströms Svedala AR","2016-02-23",3.8,12.3,93.413372151615576,7.77,20,41.6,4.5,17,70,2700,170,3800,"grumligt",2016,2,null,null,null,null,null,null,null,null,9.6283333333333321,12.228404497070434,7.0282621695962302,2.95,7.7374999999999998,7.980668526342102,7.4943314736578976,6.5,34.543333333333337,107.50619216138078,-38.419525494714108,7,43.528333333333343,49.689256983727617,37.367409682939069,6.5305000000000009,8.1129679556024055,4.9480320443975963,21.316666666666666,25.224467065203196,17.408866268130136,108.18333333333334,175.27888666465446,41.087780002012209,100,1820.8,4520.3602454185138,-878.76024541851416,130.94999999999999,305.17218670130114,-43.272186701301194,3911.6666666666665,6215.980356666556,1607.3529766667775,5000,null,null,42423,null,null,null,null,null,null,null,null,null,null,null,null,null,null,null,null,null,3.8,12.3,93.413372151615576,7.77,20,41.6,4.5,17,70,2700,170,3800]
[null,"1  Sege å, vid Brännemölla, uppströms Svedala AR","2016-04-19",8.6999999999999993,10.8,93.036854620880789,7.92,21,46.3,6.6,18,82,1200,"<10",3000,"grumligt",2016,4,null,null,null,null,null,null,null,null,9.6283333333333321,12.228404497070434,7.0282621695962302,2.95,7.7374999999999998,7.980668526342102,7.4943314736578976,6.5,34.543333333333337,107.50619216138078,-38.419525494714108,7,43.528333333333343,49.689256983727617,37.367409682939069,6.5305000000000009,8.1129679556024055,4.9480320443975963,21.316666666666666,25.224467065203196,17.408866268130136,108.18333333333334,175.27888666465446,41.087780002012209,100,1820.8,4520.3602454185138,-878.76024541851416,130.94999999999999,305.17218670130114,-43.272186701301194,3911.6666666666665,6215.980356666556,1607.3529766667775,5000,null,null,42479,null,null,null,null,null,null,null,null,null,null,null,null,null,null,null,null,null,8.6999999999999993,10.8,93.036854620880789,7.92,21,46.3,6.6,18,82,1200,10,3000]
[null,"1  Sege å, vid Brännemölla, uppströms Svedala AR","2016-06-15",17.3,8,83.440400096584924,7.75,32,41.8,7.2,20,150,500,"<10",3300,"grumligt",2016,6,null,null,null,null,null,null,null,null,9.6283333333333321,12.228404497070434,7.0282621695962302,2.95,7.7374999999999998,7.980668526342102,7.4943314736578976,6.5,34.543333333333337,107.50619216138078,-38.419525494714108,7,43.528333333333343,49.689256983727617,37.367409682939069,6.5305000000000009,8.1129679556024055,4.9480320443975963,21.316666666666666,25.224467065203196,17.408866268130136,108.18333333333334,175.27888666465446,41.087780002012209,100,1820.8,4520.3602454185138,-878.76024541851416,130.94999999999999,305.17218670130114,-43.272186701301194,3911.6666666666665,6215.980356666556,1607.3529766667775,5000,null,null,42536,null,null,null,null,null,null,null,null,null,null,null,null,null,null,null,null,null,17.3,8,83.440400096584924,7.75,32,41.8,7.2,20,150,500,10,3300]
[null,"1  Sege å, vid Brännemölla, uppströms Svedala AR","2016-08-16",15.6,6.6,66.485787272612313,7.71,26,38.5,7,21,120,410,"<10",2600,"grumligt",2016,8,null,null,null,null,null,null,null,null,9.6283333333333321,12.228404497070434,7.0282621695962302,2.95,7.7374999999999998,7.980668526342102,7.4943314736578976,6.5,34.543333333333337,107.50619216138078,-38.419525494714108,7,43.528333333333343,49.689256983727617,37.367409682939069,6.5305000000000009,8.1129679556024055,4.9480320443975963,21.316666666666666,25.224467065203196,17.408866268130136,108.18333333333334,175.27888666465446,41.087780002012209,100,1820.8,4520.3602454185138,-878.76024541851416,130.94999999999999,305.17218670130114,-43.272186701301194,3911.6666666666665,6215.980356666556,1607.3529766667775,5000,null,null,42598,null,null,null,null,null,null,null,null,null,null,null,null,null,null,null,null,null,15.6,6.6,66.485787272612313,7.71,26,38.5,7,21,120,410,10,2600]
[null,"1  Sege å, vid Brännemölla, uppströms Svedala AR","2016-10-17",8.6999999999999993,10.1,87.006688117675537,7.72,24,40.9,5,19,90,560,55,3100,"grumligt",2016,10,null,null,null,null,null,null,null,null,9.6283333333333321,12.228404497070434,7.0282621695962302,2.95,7.7374999999999998,7.980668526342102,7.4943314736578976,6.5,34.543333333333337,107.50619216138078,-38.419525494714108,7,43.528333333333343,49.689256983727617,37.367409682939069,6.5305000000000009,8.1129679556024055,4.9480320443975963,21.316666666666666,25.224467065203196,17.408866268130136,108.18333333333334,175.27888666465446,41.087780002012209,100,1820.8,4520.3602454185138,-878.76024541851416,130.94999999999999,305.17218670130114,-43.272186701301194,3911.6666666666665,6215.980356666556,1607.3529766667775,5000,null,null,42660,null,null,null,null,null,null,null,null,null,null,null,null,null,null,null,null,null,8.6999999999999993,10.1,87.006688117675537,7.72,24,40.9,5,19,90,560,55,3100]
[null,"1  Sege å, vid Brännemölla, uppströms Svedala AR","2016-12-15",2.1,12.6,91.339214092803275,7.67,15,45.9,5.2,17,50,2600,71,4100,"grumligt",2016,12,null,null,null,null,null,null,null,null,9.6283333333333321,12.228404497070434,7.0282621695962302,2.95,7.7374999999999998,7.980668526342102,7.4943314736578976,6.5,34.543333333333337,107.50619216138078,-38.419525494714108,7,43.528333333333343,49.689256983727617,37.367409682939069,6.5305000000000009,8.1129679556024055,4.9480320443975963,21.316666666666666,25.224467065203196,17.408866268130136,108.18333333333334,175.27888666465446,41.087780002012209,100,1820.8,4520.3602454185138,-878.76024541851416,130.94999999999999,305.17218670130114,-43.272186701301194,3911.6666666666665,6215.980356666556,1607.3529766667775,5000,null,null,42719,null,null,null,null,null,null,null,null,null,null,null,null,null,null,null,null,null,2.1,12.6,91.339214092803275,7.67,15,45.9,5.2,17,50,2600,71,4100]
[null,"1  Sege å, vid Brännemölla, uppströms Svedala AR","2017-02-21",4.5999999999999996,12,93.106946953025201,7.66,15,52.9,3.3,16,54,4500,230,5800,"grumligt",2017,2,null,null,null,null,null,null,null,null,9.6283333333333321,12.228404497070434,7.0282621695962302,2.95,7.7374999999999998,7.980668526342102,7.4943314736578976,6.5,34.543333333333337,107.50619216138078,-38.419525494714108,7,43.528333333333343,49.689256983727617,37.367409682939069,6.5305000000000009,8.1129679556024055,4.9480320443975963,21.316666666666666,25.224467065203196,17.408866268130136,108.18333333333334,175.27888666465446,41.087780002012209,100,1820.8,4520.3602454185138,-878.76024541851416,130.94999999999999,305.17218670130114,-43.272186701301194,3911.6666666666665,6215.980356666556,1607.3529766667775,5000,null,null,42787,null,null,null,null,null,null,null,null,null,null,null,null,null,null,null,null,null,4.5999999999999996,12,93.106946953025201,7.66,15,52.9,3.3,16,54,4500,230,5800]
[null,"1  Sege å, vid Brännemölla, uppströms Svedala AR","2017-04-18",7,12,99.089702538874178,8.1199999999999992,20,44.7,9.1,20,68,1800,"<10",3800,"grumligt",2017,4,null,null,null,null,null,null,null,null,9.6283333333333321,12.228404497070434,7.0282621695962302,2.95,7.7374999999999998,7.980668526342102,7.4943314736578976,6.5,34.543333333333337,107.50619216138078,-38.419525494714108,7,43.528333333333343,49.689256983727617,37.367409682939069,6.5305000000000009,8.1129679556024055,4.9480320443975963,21.316666666666666,25.224467065203196,17.408866268130136,108.18333333333334,175.27888666465446,41.087780002012209,100,1820.8,4520.3602454185138,-878.76024541851416,130.94999999999999,305.17218670130114,-43.272186701301194,3911.6666666666665,6215.980356666556,1607.3529766667775,5000,null,null,42843,null,null,null,null,null,null,null,null,null,null,null,null,null,null,null,null,null,7,12,99.089702538874178,8.1199999999999992,20,44.7,9.1,20,68,1800,10,3800]
[null,"1  Sege å, vid Brännemölla, uppströms Svedala AR","2017-06-21",18.5,6.3,67.282221422776018,7.81,28,40.700000000000003,7.6,23,140,270,32,2800,"grumligt",2017,6,null,null,null,null,null,null,null,null,9.6283333333333321,12.228404497070434,7.0282621695962302,2.95,7.7374999999999998,7.980668526342102,7.4943314736578976,6.5,34.543333333333337,107.50619216138078,-38.419525494714108,7,43.528333333333343,49.689256983727617,37.367409682939069,6.5305000000000009,8.1129679556024055,4.9480320443975963,21.316666666666666,25.224467065203196,17.408866268130136,108.18333333333334,175.27888666465446,41.087780002012209,100,1820.8,4520.3602454185138,-878.76024541851416,130.94999999999999,305.17218670130114,-43.272186701301194,3911.6666666666665,6215.980356666556,1607.3529766667775,5000,null,null,42907,null,null,null,null,null,null,null,null,null,null,null,null,null,null,null,null,null,18.5,6.3,67.282221422776018,7.81,28,40.700000000000003,7.6,23,140,270,32,2800]
[null,"1  Sege å, vid Brännemölla, uppströms Svedala AR","2017-08-22",17.5,7.4,77.491216291721756,7.75,19,40.4,6.05,24,100,370,"<10",2900,null,2017,8,null,null,null,null,null,null,null,null,9.6283333333333321,12.228404497070434,7.0282621695962302,2.95,7.7374999999999998,7.980668526342102,7.4943314736578976,6.5,34.543333333333337,107.50619216138078,-38.419525494714108,7,43.528333333333343,49.689256983727617,37.367409682939069,6.5305000000000009,8.1129679556024055,4.9480320443975963,21.316666666666666,25.224467065203196,17.408866268130136,108.18333333333334,175.27888666465446,41.087780002012209,100,1820.8,4520.3602454185138,-878.76024541851416,130.94999999999999,305.17218670130114,-43.272186701301194,3911.6666666666665,6215.980356666556,1607.3529766667775,5000,null,null,42969,null,null,null,null,null,null,null,null,null,null,null,null,null,null,null,null,null,17.5,7.4,77.491216291721756,7.75,19,40.4,6.05,24,100,370,10,2900]
[null,"1  Sege å, vid Brännemölla, uppströms Svedala AR","2017-10-17",12.5,9.6,90.417319687805247,7.81,22,41,7.1,23,70,760,"<10",3100,"grumligt",2017,10,null,null,null,null,null,null,null,null,9.6283333333333321,12.228404497070434,7.0282621695962302,2.95,7.7374999999999998,7.980668526342102,7.4943314736578976,6.5,34.543333333333337,107.50619216138078,-38.419525494714108,7,43.528333333333343,49.689256983727617,37.367409682939069,6.5305000000000009,8.1129679556024055,4.9480320443975963,21.316666666666666,25.224467065203196,17.408866268130136,108.18333333333334,175.27888666465446,41.087780002012209,100,1820.8,4520.3602454185138,-878.76024541851416,130.94999999999999,305.17218670130114,-43.272186701301194,3911.6666666666665,6215.980356666556,1607.3529766667775,5000,null,null,43025,null,null,null,null,null,null,null,null,null,null,null,null,null,null,null,null,null,12.5,9.6,90.417319687805247,7.81,22,41,7.1,23,70,760,10,3100]
[null,"1  Sege å, vid Brännemölla, uppströms Svedala AR","2017-12-19",2,12.7,91.808272105756956,7.78,17,42.4,5.2,21,72,1600,160,3200,"högflöde",2017,12,null,null,null,null,null,null,null,null,9.6283333333333321,12.228404497070434,7.0282621695962302,2.95,7.7374999999999998,7.980668526342102,7.4943314736578976,6.5,34.543333333333337,107.50619216138078,-38.419525494714108,7,43.528333333333343,49.689256983727617,37.367409682939069,6.5305000000000009,8.1129679556024055,4.9480320443975963,21.316666666666666,25.224467065203196,17.408866268130136,108.18333333333334,175.27888666465446,41.087780002012209,100,1820.8,4520.3602454185138,-878.76024541851416,130.94999999999999,305.17218670130114,-43.272186701301194,3911.6666666666665,6215.980356666556,1607.3529766667775,5000,null,null,43088,null,null,null,null,null,null,null,null,null,null,null,null,null,null,null,null,null,2,12.7,91.808272105756956,7.78,17,42.4,5.2,21,72,1600,160,3200]
[null,"1  Sege å, vid Brännemölla, uppströms Svedala AR","2018-02-19",2.5,13.3,97.488064323437243,7.84,12,44.1,5.0999999999999996,18,53,1700,310,3100,null,2018,2,null,null,null,null,null,null,null,null,9.6283333333333321,12.228404497070434,7.0282621695962302,2.95,7.7374999999999998,7.980668526342102,7.4943314736578976,6.5,34.543333333333337,107.50619216138078,-38.419525494714108,7,43.528333333333343,49.689256983727617,37.367409682939069,6.5305000000000009,8.1129679556024055,4.9480320443975963,21.316666666666666,25.224467065203196,17.408866268130136,108.18333333333334,175.27888666465446,41.087780002012209,100,1820.8,4520.3602454185138,-878.76024541851416,130.94999999999999,305.17218670130114,-43.272186701301194,3911.6666666666665,6215.980356666556,1607.3529766667775,5000,null,null,43150,null,null,null,null,null,null,null,null,null,null,null,null,null,null,null,null,null,2.5,13.3,97.488064323437243,7.84,12,44.1,5.0999999999999996,18,53,1700,310,3100]
[null,"1  Sege å, vid Brännemölla, uppströms Svedala AR","2018-04-16",10.6,11.7,105.48671926150379,7.83,19,43.1,6.7,17,54,1400,98,3000,"grumligt",2018,4,null,null,null,null,null,null,null,null,9.6283333333333321,12.228404497070434,7.0282621695962302,2.95,7.7374999999999998,7.980668526342102,7.4943314736578976,6.5,34.543333333333337,107.50619216138078,-38.419525494714108,7,43.528333333333343,49.689256983727617,37.367409682939069,6.5305000000000009,8.1129679556024055,4.9480320443975963,21.316666666666666,25.224467065203196,17.408866268130136,108.18333333333334,175.27888666465446,41.087780002012209,100,1820.8,4520.3602454185138,-878.76024541851416,130.94999999999999,305.17218670130114,-43.272186701301194,3911.6666666666665,6215.980356666556,1607.3529766667775,5000,null,null,43206,null,null,null,null,null,null,null,null,null,null,null,null,null,null,null,null,null,10.6,11.7,105.48671926150379,7.83,19,43.1,6.7,17,54,1400,98,3000]
[null,"1  Sege å, vid Brännemölla, uppströms Svedala AR","2018-06-20",18.100000000000001,9.1,96.429980730499835,7.83,17,41.2,5.5,19,130,1100,"<10",2800,"grumligt",2018,6,null,null,null,null,null,null,null,null,9.6283333333333321,12.228404497070434,7.0282621695962302,2.95,7.7374999999999998,7.980668526342102,7.4943314736578976,6.5,34.543333333333337,107.50619216138078,-38.419525494714108,7,43.528333333333343,49.689256983727617,37.367409682939069,6.5305000000000009,8.1129679556024055,4.9480320443975963,21.316666666666666,25.224467065203196,17.408866268130136,108.18333333333334,175.27888666465446,41.087780002012209,100,1820.8,4520.3602454185138,-878.76024541851416,130.94999999999999,305.17218670130114,-43.272186701301194,3911.6666666666665,6215.980356666556,1607.3529766667775,5000,null,null,43271,null,null,null,null,null,null,null,null,null,null,null,null,null,null,null,null,null,18.100000000000001,9.1,96.429980730499835,7.83,17,41.2,5.5,19,130,1100,10,2800]
[null,"1  Sege å, vid Brännemölla, uppströms Svedala AR","2018-08-17",19.899999999999999,6.8,74.585345584908168,7.7,14,36.299999999999997,7.8,24,120,940,27,3000,null,2018,8,null,null,null,null,null,null,null,null,9.6283333333333321,12.228404497070434,7.0282621695962302,2.95,7.7374999999999998,7.980668526342102,7.4943314736578976,6.5,34.543333333333337,107.50619216138078,-38.419525494714108,7,43.528333333333343,49.689256983727617,37.367409682939069,6.5305000000000009,8.1129679556024055,4.9480320443975963,21.316666666666666,25.224467065203196,17.408866268130136,108.18333333333334,175.27888666465446,41.087780002012209,100,1820.8,4520.3602454185138,-878.76024541851416,130.94999999999999,305.17218670130114,-43.272186701301194,3911.6666666666665,6215.980356666556,1607.3529766667775,5000,null,null,43329,null,null,null,null,null,null,null,null,null,null,null,null,null,null,null,null,null,19.899999999999999,6.8,74.585345584908168,7.7,14,36.299999999999997,7.8,24,120,940,27,3000]
[null,"1  Sege å, vid Brännemölla, uppströms Svedala AR","2018-10-16",10.5,6.1,54.86822369153883,7.68,12,46.3,6.2,20,95,1500,"<10",3100,null,2018,10,null,null,null,null,null,null,null,null,9.6283333333333321,12.228404497070434,7.0282621695962302,2.95,7.7374999999999998,7.980668526342102,7.4943314736578976,6.5,34.543333333333337,107.50619216138078,-38.419525494714108,7,43.528333333333343,49.689256983727617,37.367409682939069,6.5305000000000009,8.1129679556024055,4.9480320443975963,21.316666666666666,25.224467065203196,17.408866268130136,108.18333333333334,175.27888666465446,41.087780002012209,100,1820.8,4520.3602454185138,-878.76024541851416,130.94999999999999,305.17218670130114,-43.272186701301194,3911.6666666666665,6215.980356666556,1607.3529766667775,5000,null,null,43389,null,null,null,null,null,null,null,null,null,null,null,null,null,null,null,null,null,10.5,6.1,54.86822369153883,7.68,12,46.3,6.2,20,95,1500,10,3100]
[null,"1  Sege å, vid Brännemölla, uppströms Svedala AR","2018-12-11",5.4,10.4,82.412083138517161,7.51,3.2,80.599999999999994,2.1,15,51,19000,140,19000,"klart vatten",2018,12,null,null,null,null,null,null,null,null,9.6283333333333321,12.228404497070434,7.0282621695962302,2.95,7.7374999999999998,7.980668526342102,7.4943314736578976,6.5,34.543333333333337,107.50619216138078,-38.419525494714108,7,43.528333333333343,49.689256983727617,37.367409682939069,6.5305000000000009,8.1129679556024055,4.9480320443975963,21.316666666666666,25.224467065203196,17.408866268130136,108.18333333333334,175.27888666465446,41.087780002012209,100,1820.8,4520.3602454185138,-878.76024541851416,130.94999999999999,305.17218670130114,-43.272186701301194,3911.6666666666665,6215.980356666556,1607.3529766667775,5000,null,null,43445,null,null,null,null,null,null,null,null,null,null,null,null,null,null,null,null,null,5.4,10.4,82.412083138517161,7.51,3.2,80.599999999999994,2.1,15,51,19000,140,19000]
[null,"1  Sege å, vid Brännemölla, uppströms Svedala AR","2019-02-20",4.8,11.9,93,7.73,15,47.5,5.3,23,64,4600,79,6100,null,2019,2,null,null,null,null,null,null,null,null,9.6283333333333321,12.228404497070434,7.0282621695962302,2.95,7.7374999999999998,7.980668526342102,7.4943314736578976,6.5,34.543333333333337,107.50619216138078,-38.419525494714108,7,43.528333333333343,49.689256983727617,37.367409682939069,6.5305000000000009,8.1129679556024055,4.9480320443975963,21.316666666666666,25.224467065203196,17.408866268130136,108.18333333333334,175.27888666465446,41.087780002012209,100,1820.8,4520.3602454185138,-878.76024541851416,130.94999999999999,305.17218670130114,-43.272186701301194,3911.6666666666665,6215.980356666556,1607.3529766667775,5000,null,null,43516,null,null,null,null,null,null,null,null,null,null,null,null,null,null,null,null,null,4.8,11.9,93,7.73,15,47.5,5.3,23,64,4600,79,6100]
[null,"1  Sege å, vid Brännemölla, uppströms Svedala AR","2019-04-16",7.3,12.2,102,8.18,19,44.8,7.7,21,20,2300,"<10",3100,null,2019,4,null,null,null,null,null,null,null,null,9.6283333333333321,12.228404497070434,7.0282621695962302,2.95,7.7374999999999998,7.980668526342102,7.4943314736578976,6.5,34.543333333333337,107.50619216138078,-38.419525494714108,7,43.528333333333343,49.689256983727617,37.367409682939069,6.5305000000000009,8.1129679556024055,4.9480320443975963,21.316666666666666,25.224467065203196,17.408866268130136,108.18333333333334,175.27888666465446,41.087780002012209,100,1820.8,4520.3602454185138,-878.76024541851416,130.94999999999999,305.17218670130114,-43.272186701301194,3911.6666666666665,6215.980356666556,1607.3529766667775,5000,null,null,43571,null,null,null,null,null,null,null,null,null,null,null,null,null,null,null,null,null,7.3,12.2,102,8.18,19,44.8,7.7,21,20,2300,10,3100]
[null,"1  Sege å, vid Brännemölla, uppströms Svedala AR","2019-06-18",18.2,6,64,7.71,16,40.5,9,20,110,700,28,3100,null,2019,6,null,null,null,null,null,null,null,null,9.6283333333333321,12.228404497070434,7.0282621695962302,2.95,7.7374999999999998,7.980668526342102,7.4943314736578976,6.5,34.543333333333337,107.50619216138078,-38.419525494714108,7,43.528333333333343,49.689256983727617,37.367409682939069,6.5305000000000009,8.1129679556024055,4.9480320443975963,21.316666666666666,25.224467065203196,17.408866268130136,108.18333333333334,175.27888666465446,41.087780002012209,100,1820.8,4520.3602454185138,-878.76024541851416,130.94999999999999,305.17218670130114,-43.272186701301194,3911.6666666666665,6215.980356666556,1607.3529766667775,5000,null,null,43634,null,null,null,null,null,null,null,null,null,null,null,null,null,null,null,null,null,18.2,6,64,7.71,16,40.5,9,20,110,700,28,3100]
[null,"1  Sege å, vid Brännemölla, uppströms Svedala AR","2019-08-20",16.7,5.7,59,7.4,13,40.5,7.7,28,120,520,12,3200,null,2019,8,null,null,null,null,null,null,null,null,9.6283333333333321,12.228404497070434,7.0282621695962302,2.95,7.7374999999999998,7.980668526342102,7.4943314736578976,6.5,34.543333333333337,107.50619216138078,-38.419525494714108,7,43.528333333333343,49.689256983727617,37.367409682939069,6.5305000000000009,8.1129679556024055,4.9480320443975963,21.316666666666666,25.224467065203196,17.408866268130136,108.18333333333334,175.27888666465446,41.087780002012209,100,1820.8,4520.3602454185138,-878.76024541851416,130.94999999999999,305.17218670130114,-43.272186701301194,3911.6666666666665,6215.980356666556,1607.3529766667775,5000,null,null,43697,null,null,null,null,null,null,null,null,null,null,null,null,null,null,null,null,null,16.7,5.7,59,7.4,13,40.5,7.7,28,120,520,12,3200]
[null,"1  Sege å, vid Brännemölla, uppströms Svedala AR","2019-10-16",11.6,6.6,61,7.51,24,49.5,7.1,24,110,2000,"<10",5000,null,2019,10,null,null,null,null,null,null,null,null,9.6283333333333321,12.228404497070434,7.0282621695962302,2.95,7.7374999999999998,7.980668526342102,7.4943314736578976,6.5,34.543333333333337,107.50619216138078,-38.419525494714108,7,43.528333333333343,49.689256983727617,37.367409682939069,6.5305000000000009,8.1129679556024055,4.9480320443975963,21.316666666666666,25.224467065203196,17.408866268130136,108.18333333333334,175.27888666465446,41.087780002012209,100,1820.8,4520.3602454185138,-878.76024541851416,130.94999999999999,305.17218670130114,-43.272186701301194,3911.6666666666665,6215.980356666556,1607.3529766667775,5000,null,null,43754,null,null,null,null,null,null,null,null,null,null,null,null,null,null,null,null,null,11.6,6.6,61,7.51,24,49.5,7.1,24,110,2000,10,5000]
[null,"1  Sege å, vid Brännemölla, uppströms Svedala AR","2019-12-11",4.7,11,86,7.68,236,43.3,8.3000000000000007,24,310,4100,170,6800,"grumligt",2019,12,null,null,null,null,null,null,null,null,9.6283333333333321,12.228404497070434,7.0282621695962302,2.95,7.7374999999999998,7.980668526342102,7.4943314736578976,6.5,34.543333333333337,107.50619216138078,-38.419525494714108,7,43.528333333333343,49.689256983727617,37.367409682939069,6.5305000000000009,8.1129679556024055,4.9480320443975963,21.316666666666666,25.224467065203196,17.408866268130136,108.18333333333334,175.27888666465446,41.087780002012209,100,1820.8,4520.3602454185138,-878.76024541851416,130.94999999999999,305.17218670130114,-43.272186701301194,3911.6666666666665,6215.980356666556,1607.3529766667775,5000,null,null,43810,null,null,null,null,null,null,null,null,null,null,null,null,null,null,null,null,null,4.7,11,86,7.68,236,43.3,8.3000000000000007,24,310,4100,170,6800]
[null,"1  Sege å, vid Brännemölla, uppströms Svedala AR","2020-02-12",4.0999999999999996,12,92,7.82,31,45.9,6.8,23,110,2900,270,4900,"grumligt",2020,2,null,null,null,null,null,null,null,null,9.6283333333333321,12.228404497070434,7.0282621695962302,2.95,7.7374999999999998,7.980668526342102,7.4943314736578976,6.5,34.543333333333337,107.50619216138078,-38.419525494714108,7,43.528333333333343,49.689256983727617,37.367409682939069,6.5305000000000009,8.1129679556024055,4.9480320443975963,21.316666666666666,25.224467065203196,17.408866268130136,108.18333333333334,175.27888666465446,41.087780002012209,100,1820.8,4520.3602454185138,-878.76024541851416,130.94999999999999,305.17218670130114,-43.272186701301194,3911.6666666666665,6215.980356666556,1607.3529766667775,5000,null,null,43873,null,null,null,null,null,null,null,null,null,null,null,null,null,null,null,null,null,4.0999999999999996,12,92,7.82,31,45.9,6.8,23,110,2900,270,4900]
[null,"1  Sege å, vid Brännemölla, uppströms Svedala AR","2020-04-20",9.9,11,98,7.87,21,48,8.3000000000000007,24,98,1200,"<10",3000,null,2020,4,null,null,null,null,null,null,null,null,9.6283333333333321,12.228404497070434,7.0282621695962302,2.95,7.7374999999999998,7.980668526342102,7.4943314736578976,6.5,34.543333333333337,107.50619216138078,-38.419525494714108,7,43.528333333333343,49.689256983727617,37.367409682939069,6.5305000000000009,8.1129679556024055,4.9480320443975963,21.316666666666666,25.224467065203196,17.408866268130136,108.18333333333334,175.27888666465446,41.087780002012209,100,1820.8,4520.3602454185138,-878.76024541851416,130.94999999999999,305.17218670130114,-43.272186701301194,3911.6666666666665,6215.980356666556,1607.3529766667775,5000,null,null,43941,null,null,null,null,null,null,null,null,null,null,null,null,null,null,null,null,null,9.9,11,98,7.87,21,48,8.3000000000000007,24,98,1200,10,3000]
[null,"1  Sege å, vid Brännemölla, uppströms Svedala AR","2020-06-15",17.3,6.8,71,7.72,29,45,8.4,29,140,640,"<10",3300,"grumligt",2020,6,null,null,null,null,null,null,null,null,9.6283333333333321,12.228404497070434,7.0282621695962302,2.95,7.7374999999999998,7.980668526342102,7.4943314736578976,6.5,34.543333333333337,107.50619216138078,-38.419525494714108,7,43.528333333333343,49.689256983727617,37.367409682939069,6.5305000000000009,8.1129679556024055,4.9480320443975963,21.316666666666666,25.224467065203196,17.408866268130136,108.18333333333334,175.27888666465446,41.087780002012209,100,1820.8,4520.3602454185138,-878.76024541851416,130.94999999999999,305.17218670130114,-43.272186701301194,3911.6666666666665,6215.980356666556,1607.3529766667775,5000,null,null,43997,null,null,null,null,null,null,null,null,null,null,null,null,null,null,null,null,null,17.3,6.8,71,7.72,29,45,8.4,29,140,640,10,3300]
[null,"1  Sege å, vid Brännemölla, uppströms Svedala AR","2020-08-18",20.399999999999999,3.7,41,7.34,14,42.6,6.9,26,130,720,120,3600,"grumligt",2020,8,null,null,null,null,null,null,null,null,9.6283333333333321,12.228404497070434,7.0282621695962302,2.95,7.7374999999999998,7.980668526342102,7.4943314736578976,6.5,34.543333333333337,107.50619216138078,-38.419525494714108,7,43.528333333333343,49.689256983727617,37.367409682939069,6.5305000000000009,8.1129679556024055,4.9480320443975963,21.316666666666666,25.224467065203196,17.408866268130136,108.18333333333334,175.27888666465446,41.087780002012209,100,1820.8,4520.3602454185138,-878.76024541851416,130.94999999999999,305.17218670130114,-43.272186701301194,3911.6666666666665,6215.980356666556,1607.3529766667775,5000,null,null,44061,null,null,null,null,null,null,null,null,null,null,null,null,null,null,null,null,null,20.399999999999999,3.7,41,7.34,14,42.6,6.9,26,130,720,120,3600]
[null,"1  Sege å, vid Brännemölla, uppströms Svedala AR","2020-10-19",7.2,9.4,78,7.74,16,44.9,5.2,23,98,820,"<10",3300,"grumligt",2020,10,null,null,null,null,null,null,null,null,9.6283333333333321,12.228404497070434,7.0282621695962302,2.95,7.7374999999999998,7.980668526342102,7.4943314736578976,6.5,34.543333333333337,107.50619216138078,-38.419525494714108,7,43.528333333333343,49.689256983727617,37.367409682939069,6.5305000000000009,8.1129679556024055,4.9480320443975963,21.316666666666666,25.224467065203196,17.408866268130136,108.18333333333334,175.27888666465446,41.087780002012209,100,1820.8,4520.3602454185138,-878.76024541851416,130.94999999999999,305.17218670130114,-43.272186701301194,3911.6666666666665,6215.980356666556,1607.3529766667775,5000,null,null,44123,null,null,null,null,null,null,null,null,null,null,null,null,null,null,null,null,null,7.2,9.4,78,7.74,16,44.9,5.2,23,98,820,10,3300]
[null,"1  Sege å, vid Brännemölla, uppströms Svedala AR","2020-12-14",4.4000000000000004,10.3,79,7.66,13,54.6,5.5,22,94,1700,200,3700,"grumligt",2020,12,null,null,null,null,null,null,null,null,9.6283333333333321,12.228404497070434,7.0282621695962302,2.95,7.7374999999999998,7.980668526342102,7.4943314736578976,6.5,34.543333333333337,107.50619216138078,-38.419525494714108,7,43.528333333333343,49.689256983727617,37.367409682939069,6.5305000000000009,8.1129679556024055,4.9480320443975963,21.316666666666666,25.224467065203196,17.408866268130136,108.18333333333334,175.27888666465446,41.087780002012209,100,1820.8,4520.3602454185138,-878.76024541851416,130.94999999999999,305.17218670130114,-43.272186701301194,3911.6666666666665,6215.980356666556,1607.3529766667775,5000,null,null,44179,null,null,null,null,null,null,null,null,null,null,null,null,null,null,null,null,null,4.4000000000000004,10.3,79,7.66,13,54.6,5.5,22,94,1700,200,3700]
[]
[]
[]
[null,null,"Medel",{"$f":"AVERAGE(CD$10:CD72)","v":10.248333333333337},{"$f":"AVERAGE(CE$10:CE72)","v":9.6283333333333321},{"$f":"AVERAGE(CF$10:CF72)","v":83.454242338745644},{"$f":"AVERAGE(CG$10:CG72)","v":7.7374999999999998},{"$f":"AVERAGE(CH$10:CH72)","v":34.543333333333337},{"$f":"AVERAGE(CI$10:CI72)","v":43.528333333333343},{"$f":"IFERROR(AVERAGE(CJ$10:CJ72),\"\")","v":6.5305000000000009},{"$f":"AVERAGE(CK$10:CK72)","v":21.316666666666666},{"$f":"AVERAGE(CL$10:CL72)","v":108.18333333333334},{"$f":"AVERAGE(CM$10:CM72)","v":1820.8},{"$f":"AVERAGE(CN$10:CN72)","v":130.94999999999999},{"$f":"AVERAGE(CO$10:CO72)","v":3911.6666666666665}]
[null,null,"Std.avv.",{"$f":"STDEV(CD$10:CD72)","v":6.1991932680907089},{"$f":"STDEV(CE$10:CE72)","v":2.6000711637371019},{"$f":"STDEV(CF$10:CF72)","v":16.027069866939641},{"$f":"STDEV(CG$10:CG72)","v":0.24316852634210248},{"$f":"STDEV(CH$10:CH72)","v":72.962858828047445},{"$f":"STDEV(CI$10:CI72)","v":6.1609236503942721},{"$f":"IFERROR(STDEV(CJ$10:CJ72),\"\")","v":1.5824679556024048},{"$f":"STDEV(CK$10:CK72)","v":3.9078003985365304},{"$f":"STDEV(CL$10:CL72)","v":67.095553331321128},{"$f":"STDEV(CM$10:CM72)","v":2699.5602454185141},{"$f":"STDEV(CN$10:CN72)","v":174.22218670130118},{"$f":"STDEV(CO$10:CO72)","v":2304.313689999889}]
[null,null,"Max",{"$f":"MAX(CD$10:CD72)","v":21.1},{"$f":"MAX(CE$10:CE72)","v":13.5},{"$f":"MAX(CF$10:CF72)","v":115.71704939600069},{"$f":"MAX(CG$10:CG72)","v":8.6999999999999993},{"$f":"MAX(CH$10:CH72)","v":520},{"$f":"MAX(CI$10:CI72)","v":80.599999999999994},{"$f":"MAX(CJ$10:CJ72)","v":9.8000000000000007},{"$f":"MAX(CK$10:CK72)","v":32},{"$f":"MAX(CL$10:CL72)","v":440},{"$f":"MAX(CM$10:CM72)","v":19000},{"$f":"MAX(CN$10:CN72)","v":770},{"$f":"MAX(CO$10:CO72)","v":19000}]
[null,null,"Min",{"$f":"MIN(CD$10:CD72)","v":0.7},{"$f":"MIN(CE$10:CE72)","v":3.7},{"$f":"MIN(CF$10:CF72)","v":41},{"$f":"MIN(CG$10:CG72)","v":7.13},{"$f":"MIN(CH$10:CH72)","v":3.2},{"$f":"MIN(CI$10:CI72)","v":32.5},{"$f":"MIN(CJ$10:CJ72)","v":2.1},{"$f":"MIN(CK$10:CK72)","v":15},{"$f":"MIN(CL$10:CL72)","v":20},{"$f":"MIN(CM$10:CM72)","v":58},{"$f":"MIN(CN$10:CN72)","v":10},{"$f":"MIN(CO$10:CO72)","v":2300}]
[null,null,"Antal",{"$f":"COUNTA(D$10:D72)","v":60},{"$f":"COUNTA(E$10:E72)","v":60},{"$f":"COUNTA(F$10:F72)","v":60},{"$f":"COUNTA(G$10:G72)","v":60},{"$f":"COUNTA(H$10:H72)","v":60},{"$f":"COUNTA(I$10:I72)","v":60},{"$f":"COUNTA(J$10:J72)","v":60},{"$f":"COUNTA(K$10:K72)","v":60},{"$f":"COUNTA(L$10:L72)","v":60},{"$f":"COUNTA(M$10:M72)","v":60},{"$f":"COUNTA(N$10:N72)","v":60},{"$f":"COUNTA(O$10:O72)","v":60}]
[null,null,"SISTA"]
[]
[]
[null,null,null,null,"OBS! Värden < a (och > a) hanteras som a i beräkning av medelvärde, standardavvikelse, min och max"]

{"sheet":"Diagram","index":7,"n_rows":182,"n_cols":45,"rows_kept":182,"cut":false,"hidden":false,"merged":[]}
[]
[]
[null,null,"Provpunkt:",null,null,null,null,null,null,null,null,null,null,null,null,null,null,"Senaste provtagningsdatum",null,null,null,null,null,null,null,null,null,null,null,null,null,null,null,null,null,null,null,null,null,null,null,null,null,"Senaste provtagningsdatum"]
[null,null,{"$f":"Statistik!$B8","v":"1  Sege å, vid Brännemölla, uppströms Svedala AR"},null,null,null,null,"Statistik för:",{"$f":"MIN(Statistik!$C10:$C72)","v":"2011-02-22"},"-",{"$f":"MAX(Statistik!$C10:$C72)","v":"2020-12-14"},null,null,null,null,null,null,{"$f":"IF((VLOOKUP(C4,Provpunkter!B1:C16,2,FALSE))=6,MAX(RS!E1:E8),IF((VLOOKUP(C4,Provpunkter!B1:C16,2,FALSE))=5,MAX(RS!E57:E61),RS!E77))","v":"2021-12-20"},null,null,null,null,null,null,null,null,null,null,null,null,null,null,null,null,null,null,null,null,null,null,null,null,null,"2021-02-15"]
[]
[]
[null,null,null,null,null,null,null,null,null,null,null,null,"Syre","halt",null,"mättnad",null,"Årets resultat",null,null,null,null,null,null,null,null,null,null,null,null,null,null,null,null,null,null,null,null,null,null,null,null,null,"Årets resultat"]
[null,null,null,null,null,null,null,null,null,null,null,null,null,"mg/l",null,"%",null,"Datum","mg/l","%",null,null,null,null,null,null,null,null,null,null,null,null,null,null,null,null,null,null,null,null,null,null,null,"Datum","mg/l"]
[null,null,null,null,null,null,null,null,null,null,null,null,"Medel",{"$f":"Statistik!E$73","v":9.6283333333333321},null,{"$f":"Statistik!F$73","v":83.454242338745644},null,{"$f":"IFERROR(VLOOKUP(CONCATENATE($C$4,\"1\"),RS!$B$3:$R$170,4,FALSE),\"\")","v":""},{"$f":"IFERROR(VLOOKUP(CONCATENATE($C$4,\"1\"),RS!$B$3:$R$170,7,FALSE),\"\")","v":""},{"$f":"IFERROR(VLOOKUP(CONCATENATE($C$4,\"1\"),RS!$B$3:$R$170,8,FALSE),\"\")","v":""},null,null,null,null,null,null,null,null,null,null,null,null,null,null,null,null,null,null,null,null,null,null,null,null,""]
[null,null,null,null,null,null,null,null,null,null,null,null,"Std.avv.",{"$f":"Statistik!E$74","v":2.6000711637371019},null,{"$f":"Statistik!F$74","v":16.027069866939641},null,{"$f":"IFERROR(VLOOKUP(CONCATENATE($C$4,\"2\"),RS!$B$3:$R$170,4,FALSE),\"\")","v":"2021-02-15"},{"$f":"IFERROR(VLOOKUP(CONCATENATE($C$4,\"2\"),RS!$B$3:$R$170,7,FALSE),\"\")","v":14},{"$f":"IFERROR(VLOOKUP(CONCATENATE($C$4,\"2\"),RS!$B$3:$R$170,8,FALSE),\"\")","v":97},null,null,null,null,null,null,null,null,null,null,null,null,null,null,null,null,null,null,null,null,null,null,null,"2021-02-15",14]
[null,null,null,null,null,null,null,null,null,null,null,null,"Max",{"$f":"Statistik!E$75","v":13.5},null,{"$f":"Statistik!F$75","v":115.71704939600069},null,{"$f":"IFERROR(VLOOKUP(CONCATENATE($C$4,\"3\"),RS!$B$3:$R$170,4,FALSE),\"\")","v":""},{"$f":"IFERROR(VLOOKUP(CONCATENATE($C$4,\"3\"),RS!$B$3:$R$170,7,FALSE),\"\")","v":""},{"$f":"IFERROR(VLOOKUP(CONCATENATE($C$4,\"3\"),RS!$B$3:$R$170,8,FALSE),\"\")","v":""},null,null,null,null,null,null,null,null,null,null,null,null,null,null,null,null,null,null,null,null,null,null,null,null,""]
[null,null,null,null,null,null,null,null,null,null,null,null,"Min",{"$f":"Statistik!E$76","v":3.7},null,{"$f":"Statistik!F$76","v":41},null,{"$f":"IFERROR(VLOOKUP(CONCATENATE($C$4,\"4\"),RS!$B$3:$R$170,4,FALSE),\"\")","v":"2021-04-19"},{"$f":"IFERROR(VLOOKUP(CONCATENATE($C$4,\"4\"),RS!$B$3:$R$170,7,FALSE),\"\")","v":11.2},{"$f":"IFERROR(VLOOKUP(CONCATENATE($C$4,\"4\"),RS!$B$3:$R$170,8,FALSE),\"\")","v":99},null,null,null,null,null,null,null,null,null,null,null,null,null,null,null,null,null,null,null,null,null,null,null,null,""]
[null,null,null,null,null,null,null,null,null,null,null,null,"Antal värden",{"$f":"Statistik!E$77","v":60},null,null,null,{"$f":"IFERROR(VLOOKUP(CONCATENATE($C$4,\"5\"),RS!$B$3:$R$170,4,FALSE),\"\")","v":""},{"$f":"IFERROR(VLOOKUP(CONCATENATE($C$4,\"5\"),RS!$B$3:$R$170,7,FALSE),\"\")","v":""},{"$f":"IFERROR(VLOOKUP(CONCATENATE($C$4,\"5\"),RS!$B$3:$R$170,8,FALSE),\"\")","v":""},null,null,null,null,null,null,null,null,null,null,null,null,null,null,null,null,null,null,null,null,null,null,null,null,""]
[null,null,null,null,null,null,null,null,null,null,null,null,null,null,null,null,null,{"$f":"IFERROR(VLOOKUP(CONCATENATE($C$4,\"6\"),RS!$B$3:$R$170,4,FALSE),\"\")","v":"2021-06-15"},{"$f":"IFERROR(VLOOKUP(CONCATENATE($C$4,\"6\"),RS!$B$3:$R$170,7,FALSE),\"\")","v":4.3},{"$f":"IFERROR(VLOOKUP(CONCATENATE($C$4,\"6\"),RS!$B$3:$R$170,8,FALSE),\"\")","v":44},null,null,null,null,null,null,null,null,null,null,null,null,null,null,null,null,null,null,null,null,null,null,null,null,""]
[null,null,null,null,null,null,null,null,null,null,null,null,"Senaste",{"$f":"VLOOKUP(TRIM(CONCATENATE($C$4,$R$4)),RS!$A$3:$R$170,8,FALSE)","v":10.5},null,{"$f":"VLOOKUP(TRIM(CONCATENATE($C$4,$R$4)),RS!$A$3:$R$170,9,FALSE)","v":74},null,{"$f":"IFERROR(VLOOKUP(CONCATENATE($C$4,\"7\"),RS!$B$3:$R$170,4,FALSE),\"\")","v":""},{"$f":"IFERROR(VLOOKUP(CONCATENATE($C$4,\"7\"),RS!$B$3:$R$170,7,FALSE),\"\")","v":""},{"$f":"IFERROR(VLOOKUP(CONCATENATE($C$4,\"7\"),RS!$B$3:$R$170,8,FALSE),\"\")","v":""},null,null,null,null,null,null,null,null,null,null,null,null,null,null,null,null,null,null,null,null,null,null,null,null,""]
[null,null,null,null,null,null,null,null,null,null,null,null,null,null,null,null,null,{"$f":"IFERROR(VLOOKUP(CONCATENATE($C$4,\"8\"),RS!$B$3:$R$170,4,FALSE),\"\")","v":"2021-08-19"},{"$f":"IFERROR(VLOOKUP(CONCATENATE($C$4,\"8\"),RS!$B$3:$R$170,7,FALSE),\"\")","v":8.5},{"$f":"IFERROR(VLOOKUP(CONCATENATE($C$4,\"8\"),RS!$B$3:$R$170,8,FALSE),\"\")","v":84},null,null,null,null,null,null,null,null,null,null,null,null,null,null,null,null,null,null,null,null,null,null,null,null,""]
[null,null,null,null,null,null,null,null,null,null,null,null,null,null,null,null,null,{"$f":"IFERROR(VLOOKUP(CONCATENATE($C$4,\"9\"),RS!$B$3:$R$170,4,FALSE),\"\")","v":""},{"$f":"IFERROR(VLOOKUP(CONCATENATE($C$4,\"9\"),RS!$B$3:$R$170,7,FALSE),\"\")","v":""},{"$f":"IFERROR(VLOOKUP(CONCATENATE($C$4,\"9\"),RS!$B$3:$R$170,8,FALSE),\"\")","v":""},null,null,null,null,null,null,null,null,null,null,null,null,null,null,null,null,null,null,null,null,null,null,null,null,""]
[null,null,null,null,null,null,null,null,null,null,null,null,null,null,null,null,null,{"$f":"IFERROR(VLOOKUP(CONCATENATE($C$4,\"10\"),RS!$B$3:$R$170,4,FALSE),\"\")","v":"2021-10-20"},{"$f":"IFERROR(VLOOKUP(CONCATENATE($C$4,\"10\"),RS!$B$3:$R$170,7,FALSE),\"\")","v":7.5},{"$f":"IFERROR(VLOOKUP(CONCATENATE($C$4,\"10\"),RS!$B$3:$R$170,8,FALSE),\"\")","v":69},null,null,null,null,null,null,null,null,null,null,null,null,null,null,null,null,null,null,null,null,null,null,null,null,""]
[null,null,null,null,null,null,null,null,null,null,null,null,null,null,null,null,null,{"$f":"IFERROR(VLOOKUP(CONCATENATE($C$4,\"11\"),RS!$B$3:$R$170,4,FALSE),\"\")","v":""},{"$f":"IFERROR(VLOOKUP(CONCATENATE($C$4,\"11\"),RS!$B$3:$R$170,7,FALSE),\"\")","v":""},{"$f":"IFERROR(VLOOKUP(CONCATENATE($C$4,\"11\"),RS!$B$3:$R$170,8,FALSE),\"\")","v":""},null,null,null,null,null,null,null,null,null,null,null,null,null,null,null,null,null,null,null,null,null,null,null,null,""]
[null,null,null,null,null,null,null,null,null,null,null,null,null,null,null,null,null,{"$f":"IFERROR(VLOOKUP(CONCATENATE($C$4,\"12\"),RS!$B$3:$R$170,4,FALSE),\"\")","v":"2021-12-20"},{"$f":"IFERROR(VLOOKUP(CONCATENATE($C$4,\"12\"),RS!$B$3:$R$170,7,FALSE),\"\")","v":10.5},{"$f":"IFERROR(VLOOKUP(CONCATENATE($C$4,\"12\"),RS!$B$3:$R$170,8,FALSE),\"\")","v":74},null,null,null,null,null,null,null,null,null,null,null,null,null,null,null,null,null,null,null,null,null,null,null,null,""]
[]
[]
[]
[]
[null,null,null,null,null,null,null,null,null,null,null,null,"Tot-N","µg/l",null,null,null,"Årets resultat",null,null,null,null,null,null,null,null,null,null,null,null,null,null,null,null,null,null,null,null,null,null,null,null,null,"Årets resultat"]
[null,null,null,null,null,null,null,null,null,null,null,null,null,null,null,null,null,"Datum","µg/l",null,null,null,null,null,null,null,null,null,null,null,null,null,null,null,null,null,null,null,null,null,null,null,null,"Datum","µg/l"]
[null,null,null,null,null,null,null,null,null,null,null,null,"Medel",{"$f":"Statistik!O$73","v":3911.6666666666665},null,null,null,{"$f":"IFERROR(VLOOKUP(CONCATENATE($C$4,\"1\"),RS!$B$3:$R$170,4,FALSE),\"\")","v":""},{"$f":"IFERROR(VLOOKUP(CONCATENATE($C$4,\"1\"),RS!$B$3:$R$170,17,FALSE),\"\")","v":""},null,null,null,null,null,null,null,null,null,null,null,null,null,null,null,null,null,null,null,null,null,null,null,null,null,""]
[null,null,null,null,null,null,null,null,null,null,null,null,"Std.avv.",{"$f":"Statistik!O$74","v":2304.313689999889},null,null,null,{"$f":"IFERROR(VLOOKUP(CONCATENATE($C$4,\"2\"),RS!$B$3:$R$170,4,FALSE),\"\")","v":"2021-02-15"},{"$f":"IFERROR(VLOOKUP(CONCATENATE($C$4,\"2\"),RS!$B$3:$R$170,17,FALSE),\"\")","v":3600},null,null,null,null,null,null,null,null,null,null,null,null,null,null,null,null,null,null,null,null,null,null,null,null,"2021-02-15",3600]
[null,null,null,null,null,null,null,null,null,null,null,null,"Max",{"$f":"Statistik!O$75","v":19000},null,null,null,{"$f":"IFERROR(VLOOKUP(CONCATENATE($C$4,\"3\"),RS!$B$3:$R$170,4,FALSE),\"\")","v":""},{"$f":"IFERROR(VLOOKUP(CONCATENATE($C$4,\"3\"),RS!$B$3:$R$170,17,FALSE),\"\")","v":""},null,null,null,null,null,null,null,null,null,null,null,null,null,null,null,null,null,null,null,null,null,null,null,null,null,""]
[null,null,null,null,null,null,null,null,null,null,null,null,"Min",{"$f":"Statistik!O$76","v":2300},null,null,null,{"$f":"IFERROR(VLOOKUP(CONCATENATE($C$4,\"4\"),RS!$B$3:$R$170,4,FALSE),\"\")","v":"2021-04-19"},{"$f":"IFERROR(VLOOKUP(CONCATENATE($C$4,\"4\"),RS!$B$3:$R$170,17,FALSE),\"\")","v":2900},null,null,null,null,null,null,null,null,null,null,null,null,null,null,null,null,null,null,null,null,null,null,null,null,null,""]
[null,null,null,null,null,null,null,null,null,null,null,null,"Antal värden",{"$f":"Statistik!O$77","v":60},null,null,null,{"$f":"IFERROR(VLOOKUP(CONCATENATE($C$4,\"5\"),RS!$B$3:$R$170,4,FALSE),\"\")","v":""},{"$f":"IFERROR(VLOOKUP(CONCATENATE($C$4,\"5\"),RS!$B$3:$R$170,17,FALSE),\"\")","v":""},null,null,null,null,null,null,null,null,null,null,null,null,null,null,null,null,null,null,null,null,null,null,null,null,null,""]
[null,null,null,null,null,null,null,null,null,null,null,null,null,null,null,null,null,{"$f":"IFERROR(VLOOKUP(CONCATENATE($C$4,\"6\"),RS!$B$3:$R$170,4,FALSE),\"\")","v":"2021-06-15"},{"$f":"IFERROR(VLOOKUP(CONCATENATE($C$4,\"6\"),RS!$B$3:$R$170,17,FALSE),\"\")","v":3300},null,null,null,null,null,null,null,null,null,null,null,null,null,null,null,null,null,null,null,null,null,null,null,null,null,""]
[null,null,null,null,null,null,null,null,null,null,null,null,"Senaste",{"$f":"VLOOKUP(TRIM(CONCATENATE($C$4,$R$4)),RS!$A$3:$R$170,18,FALSE)","v":4400},null,null,null,{"$f":"IFERROR(VLOOKUP(CONCATENATE($C$4,\"7\"),RS!$B$3:$R$170,4,FALSE),\"\")","v":""},{"$f":"IFERROR(VLOOKUP(CONCATENATE($C$4,\"7\"),RS!$B$3:$R$170,17,FALSE),\"\")","v":""},null,null,null,null,null,null,null,null,null,null,null,null,null,null,null,null,null,null,null,null,null,null,null,null,null,""]
[null,null,null,null,null,null,null,null,null,null,null,null,null,null,null,null,null,{"$f":"IFERROR(VLOOKUP(CONCATENATE($C$4,\"8\"),RS!$B$3:$R$170,4,FALSE),\"\")","v":"2021-08-19"},{"$f":"IFERROR(VLOOKUP(CONCATENATE($C$4,\"8\"),RS!$B$3:$R$170,17,FALSE),\"\")","v":3000},null,null,null,null,null,null,null,null,null,null,null,null,null,null,null,null,null,null,null,null,null,null,null,null,null,""]
[null,null,null,null,null,null,null,null,null,null,null,null,null,null,null,null,null,{"$f":"IFERROR(VLOOKUP(CONCATENATE($C$4,\"9\"),RS!$B$3:$R$170,4,FALSE),\"\")","v":""},{"$f":"IFERROR(VLOOKUP(CONCATENATE($C$4,\"9\"),RS!$B$3:$R$170,17,FALSE),\"\")","v":""},null,null,null,null,null,null,null,null,null,null,null,null,null,null,null,null,null,null,null,null,null,null,null,null,null,""]
[null,null,null,null,null,null,null,null,null,null,null,null,null,null,null,null,null,{"$f":"IFERROR(VLOOKUP(CONCATENATE($C$4,\"10\"),RS!$B$3:$R$170,4,FALSE),\"\")","v":"2021-10-20"},{"$f":"IFERROR(VLOOKUP(CONCATENATE($C$4,\"10\"),RS!$B$3:$R$170,17,FALSE),\"\")","v":7700},null,null,null,null,null,null,null,null,null,null,null,null,null,null,null,null,null,null,null,null,null,null,null,null,null,""]
[null,null,null,null,null,null,null,null,null,null,null,null,null,null,null,null,null,{"$f":"IFERROR(VLOOKUP(CONCATENATE($C$4,\"11\"),RS!$B$3:$R$170,4,FALSE),\"\")","v":""},{"$f":"IFERROR(VLOOKUP(CONCATENATE($C$4,\"11\"),RS!$B$3:$R$170,17,FALSE),\"\")","v":""},null,null,null,null,null,null,null,null,null,null,null,null,null,null,null,null,null,null,null,null,null,null,null,null,null,""]
[null,null,null,null,null,null,null,null,null,null,null,null,null,null,null,null,null,{"$f":"IFERROR(VLOOKUP(CONCATENATE($C$4,\"12\"),RS!$B$3:$R$170,4,FALSE),\"\")","v":"2021-12-20"},{"$f":"IFERROR(VLOOKUP(CONCATENATE($C$4,\"12\"),RS!$B$3:$R$170,17,FALSE),\"\")","v":4400},null,null,null,null,null,null,null,null,null,null,null,null,null,null,null,null,null,null,null,null,null,null,null,null,null,""]
[]
[]
[]
[]
[null,null,null,null,null,null,null,null,null,null,null,null,"Tot-P","µg/l",null,null,null,"Årets resultat",null,null,null,null,null,null,null,null,null,null,null,null,null,null,null,null,null,null,null,null,null,null,null,null,null,"Årets resultat"]
[null,null,null,null,null,null,null,null,null,null,null,null,null,null,null,null,null,"Datum","µg/l",null,null,null,null,null,null,null,null,null,null,null,null,null,null,null,null,null,null,null,null,null,null,null,null,"Datum","µg/l"]
[null,null,null,null,null,null,null,null,null,null,null,null,"Medel",{"$f":"Statistik!L$73","v":108.18333333333334},null,null,null,{"$f":"IFERROR(VLOOKUP(CONCATENATE($C$4,\"1\"),RS!$B$3:$R$170,4,FALSE),\"\")","v":""},{"$f":"IFERROR(VLOOKUP(CONCATENATE($C$4,\"1\"),RS!$B$3:$R$170,14,FALSE),\"\")","v":""},null,null,null,null,null,null,null,null,null,null,null,null,null,null,null,null,null,null,null,null,null,null,null,null,null,""]
[null,null,null,null,null,null,null,null,null,null,null,null,"Std.avv.",{"$f":"Statistik!L$74","v":67.095553331321128},null,null,null,{"$f":"IFERROR(VLOOKUP(CONCATENATE($C$4,\"2\"),RS!$B$3:$R$170,4,FALSE),\"\")","v":"2021-02-15"},{"$f":"IFERROR(VLOOKUP(CONCATENATE($C$4,\"2\"),RS!$B$3:$R$170,14,FALSE),\"\")","v":65},null,null,null,null,null,null,null,null,null,null,null,null,null,null,null,null,null,null,null,null,null,null,null,null,"2021-02-15",65]
[null,null,null,null,null,null,null,null,null,null,null,null,"Max",{"$f":"Statistik!L$75","v":440},null,null,null,{"$f":"IFERROR(VLOOKUP(CONCATENATE($C$4,\"3\"),RS!$B$3:$R$170,4,FALSE),\"\")","v":""},{"$f":"IFERROR(VLOOKUP(CONCATENATE($C$4,\"3\"),RS!$B$3:$R$170,14,FALSE),\"\")","v":""},null,null,null,null,null,null,null,null,null,null,null,null,null,null,null,null,null,null,null,null,null,null,null,null,null,""]
[null,null,null,null,null,null,null,null,null,null,null,null,"Min",{"$f":"Statistik!L$76","v":20},null,null,null,{"$f":"IFERROR(VLOOKUP(CONCATENATE($C$4,\"4\"),RS!$B$3:$R$170,4,FALSE),\"\")","v":"2021-04-19"},{"$f":"IFERROR(VLOOKUP(CONCATENATE($C$4,\"4\"),RS!$B$3:$R$170,14,FALSE),\"\")","v":66},null,null,null,null,null,null,null,null,null,null,null,null,null,null,null,null,null,null,null,null,null,null,null,null,null,""]
[null,null,null,null,null,null,null,null,null,null,null,null,"Antal värden",{"$f":"Statistik!L$77","v":60},null,null,null,{"$f":"IFERROR(VLOOKUP(CONCATENATE($C$4,\"5\"),RS!$B$3:$R$170,4,FALSE),\"\")","v":""},{"$f":"IFERROR(VLOOKUP(CONCATENATE($C$4,\"5\"),RS!$B$3:$R$170,14,FALSE),\"\")","v":""},null,null,null,null,null,null,null,null,null,null,null,null,null,null,null,null,null,null,null,null,null,null,null,null,null,""]
[null,null,null,null,null,null,null,null,null,null,null,null,null,null,null,null,null,{"$f":"IFERROR(VLOOKUP(CONCATENATE($C$4,\"6\"),RS!$B$3:$R$170,4,FALSE),\"\")","v":"2021-06-15"},{"$f":"IFERROR(VLOOKUP(CONCATENATE($C$4,\"6\"),RS!$B$3:$R$170,14,FALSE),\"\")","v":160},null,null,null,null,null,null,null,null,null,null,null,null,null,null,null,null,null,null,null,null,null,null,null,null,null,""]
[null,null,null,null,null,null,null,null,null,null,null,null,"Senaste",{"$f":"VLOOKUP(TRIM(CONCATENATE($C$4,$R$4)),RS!$A$3:$R$170,15,FALSE)","v":120},null,null,null,{"$f":"IFERROR(VLOOKUP(CONCATENATE($C$4,\"7\"),RS!$B$3:$R$170,4,FALSE),\"\")","v":""},{"$f":"IFERROR(VLOOKUP(CONCATENATE($C$4,\"7\"),RS!$B$3:$R$170,14,FALSE),\"\")","v":""},null,null,null,null,null,null,null,null,null,null,null,null,null,null,null,null,null,null,null,null,null,null,null,null,null,""]
[null,null,null,null,null,null,null,null,null,null,null,null,null,null,null,null,null,{"$f":"IFERROR(VLOOKUP(CONCATENATE($C$4,\"8\"),RS!$B$3:$R$170,4,FALSE),\"\")","v":"2021-08-19"},{"$f":"IFERROR(VLOOKUP(CONCATENATE($C$4,\"8\"),RS!$B$3:$R$170,14,FALSE),\"\")","v":120},null,null,null,null,null,null,null,null,null,null,null,null,null,null,null,null,null,null,null,null,null,null,null,null,null,""]
[null,null,null,null,null,null,null,null,null,null,null,null,null,null,null,null,null,{"$f":"IFERROR(VLOOKUP(CONCATENATE($C$4,\"9\"),RS!$B$3:$R$170,4,FALSE),\"\")","v":""},{"$f":"IFERROR(VLOOKUP(CONCATENATE($C$4,\"9\"),RS!$B$3:$R$170,14,FALSE),\"\")","v":""},null,null,null,null,null,null,null,null,null,null,null,null,null,null,null,null,null,null,null,null,null,null,null,null,null,""]
[null,null,null,null,null,null,null,null,null,null,null,null,null,null,null,null,null,{"$f":"IFERROR(VLOOKUP(CONCATENATE($C$4,\"10\"),RS!$B$3:$R$170,4,FALSE),\"\")","v":"2021-10-20"},{"$f":"IFERROR(VLOOKUP(CONCATENATE($C$4,\"10\"),RS!$B$3:$R$170,14,FALSE),\"\")","v":210},null,null,null,null,null,null,null,null,null,null,null,null,null,null,null,null,null,null,null,null,null,null,null,null,null,""]
[null,null,null,null,null,null,null,null,null,null,null,null,null,null,null,null,null,{"$f":"IFERROR(VLOOKUP(CONCATENATE($C$4,\"11\"),RS!$B$3:$R$170,4,FALSE),\"\")","v":""},{"$f":"IFERROR(VLOOKUP(CONCATENATE($C$4,\"11\"),RS!$B$3:$R$170,14,FALSE),\"\")","v":""},null,null,null,null,null,null,null,null,null,null,null,null,null,null,null,null,null,null,null,null,null,null,null,null,null,""]
[null,null,null,null,null,null,null,null,null,null,null,null,null,null,null,null,null,{"$f":"IFERROR(VLOOKUP(CONCATENATE($C$4,\"12\"),RS!$B$3:$R$170,4,FALSE),\"\")","v":"2021-12-20"},{"$f":"IFERROR(VLOOKUP(CONCATENATE($C$4,\"12\"),RS!$B$3:$R$170,14,FALSE),\"\")","v":120},null,null,null,null,null,null,null,null,null,null,null,null,null,null,null,null,null,null,null,null,null,null,null,null,null,""]
[]
[]
[]
[]
[null,null,null,null,null,null,null,null,null,null,null,null,"pH",null,null,null,null,"Årets resultat",null,null,null,null,null,null,null,null,null,null,null,null,null,null,null,null,null,null,null,null,null,null,null,null,null,"Årets resultat"]
[null,null,null,null,null,null,null,null,null,null,null,null,null,null,null,null,null,"Datum",null,null,null,null,null,null,null,null,null,null,null,null,null,null,null,null,null,null,null,null,null,null,null,null,null,"Datum"]
[null,null,null,null,null,null,null,null,null,null,null,null,"Medel",{"$f":"Statistik!G$73","v":7.7374999999999998},null,null,null,{"$f":"IFERROR(VLOOKUP(CONCATENATE($C$4,\"1\"),RS!$B$3:$R$170,4,FALSE),\"\")","v":""},{"$f":"IFERROR(VLOOKUP(CONCATENATE($C$4,\"1\"),RS!$B$3:$R$170,9,FALSE),\"\")","v":""},null,null,null,null,null,null,null,null,null,null,null,null,null,null,null,null,null,null,null,null,null,null,null,null,null,""]
[null,null,null,null,null,null,null,null,null,null,null,null,"Std.avv.",{"$f":"Statistik!G$74","v":0.24316852634210248},null,null,null,{"$f":"IFERROR(VLOOKUP(CONCATENATE($C$4,\"2\"),RS!$B$3:$R$170,4,FALSE),\"\")","v":"2021-02-15"},{"$f":"IFERROR(VLOOKUP(CONCATENATE($C$4,\"2\"),RS!$B$3:$R$170,9,FALSE),\"\")","v":7.78},null,null,null,null,null,null,null,null,null,null,null,null,null,null,null,null,null,null,null,null,null,null,null,null,"2021-02-15",7.78]
[null,null,null,null,null,null,null,null,null,null,null,null,"Max",{"$f":"Statistik!G$75","v":8.6999999999999993},null,null,null,{"$f":"IFERROR(VLOOKUP(CONCATENATE($C$4,\"3\"),RS!$B$3:$R$170,4,FALSE),\"\")","v":""},{"$f":"IFERROR(VLOOKUP(CONCATENATE($C$4,\"3\"),RS!$B$3:$R$170,9,FALSE),\"\")","v":""},null,null,null,null,null,null,null,null,null,null,null,null,null,null,null,null,null,null,null,null,null,null,null,null,null,""]
[null,null,null,null,null,null,null,null,null,null,null,null,"Min",{"$f":"Statistik!G$76","v":7.13},null,null,null,{"$f":"IFERROR(VLOOKUP(CONCATENATE($C$4,\"4\"),RS!$B$3:$R$170,4,FALSE),\"\")","v":"2021-04-19"},{"$f":"IFERROR(VLOOKUP(CONCATENATE($C$4,\"4\"),RS!$B$3:$R$170,9,FALSE),\"\")","v":7.81},null,null,null,null,null,null,null,null,null,null,null,null,null,null,null,null,null,null,null,null,null,null,null,null,null,""]
[null,null,null,null,null,null,null,null,null,null,null,null,"Antal värden",{"$f":"Statistik!G$77","v":60},null,null,null,{"$f":"IFERROR(VLOOKUP(CONCATENATE($C$4,\"5\"),RS!$B$3:$R$170,4,FALSE),\"\")","v":""},{"$f":"IFERROR(VLOOKUP(CONCATENATE($C$4,\"5\"),RS!$B$3:$R$170,9,FALSE),\"\")","v":""},null,null,null,null,null,null,null,null,null,null,null,null,null,null,null,null,null,null,null,null,null,null,null,null,null,""]
[null,null,null,null,null,null,null,null,null,null,null,null,null,null,null,null,null,{"$f":"IFERROR(VLOOKUP(CONCATENATE($C$4,\"6\"),RS!$B$3:$R$170,4,FALSE),\"\")","v":"2021-06-15"},{"$f":"IFERROR(VLOOKUP(CONCATENATE($C$4,\"6\"),RS!$B$3:$R$170,9,FALSE),\"\")","v":7.41},null,null,null,null,null,null,null,null,null,null,null,null,null,null,null,null,null,null,null,null,null,null,null,null,null,""]
[null,null,null,null,null,null,null,null,null,null,null,null,"Senaste",{"$f":"VLOOKUP(TRIM(CONCATENATE($C$4,$R$4)),RS!$A$3:$R$170,10,FALSE)","v":7.58},null,null,null,{"$f":"IFERROR(VLOOKUP(CONCATENATE($C$4,\"7\"),RS!$B$3:$R$170,4,FALSE),\"\")","v":""},{"$f":"IFERROR(VLOOKUP(CONCATENATE($C$4,\"7\"),RS!$B$3:$R$170,9,FALSE),\"\")","v":""},null,null,null,null,null,null,null,null,null,null,null,null,null,null,null,null,null,null,null,null,null,null,null,null,null,""]
[null,null,null,null,null,null,null,null,null,null,null,null,null,null,null,null,null,{"$f":"IFERROR(VLOOKUP(CONCATENATE($C$4,\"8\"),RS!$B$3:$R$170,4,FALSE),\"\")","v":"2021-08-19"},{"$f":"IFERROR(VLOOKUP(CONCATENATE($C$4,\"8\"),RS!$B$3:$R$170,9,FALSE),\"\")","v":7.5},null,null,null,null,null,null,null,null,null,null,null,null,null,null,null,null,null,null,null,null,null,null,null,null,null,""]
[null,null,null,null,null,null,null,null,null,null,null,null,null,null,null,null,null,{"$f":"IFERROR(VLOOKUP(CONCATENATE($C$4,\"9\"),RS!$B$3:$R$170,4,FALSE),\"\")","v":""},{"$f":"IFERROR(VLOOKUP(CONCATENATE($C$4,\"9\"),RS!$B$3:$R$170,9,FALSE),\"\")","v":""},null,null,null,null,null,null,null,null,null,null,null,null,null,null,null,null,null,null,null,null,null,null,null,null,null,""]
[null,null,null,null,null,null,null,null,null,null,null,null,null,null,null,null,null,{"$f":"IFERROR(VLOOKUP(CONCATENATE($C$4,\"10\"),RS!$B$3:$R$170,4,FALSE),\"\")","v":"2021-10-20"},{"$f":"IFERROR(VLOOKUP(CONCATENATE($C$4,\"10\"),RS!$B$3:$R$170,9,FALSE),\"\")","v":7.62},null,null,null,null,null,null,null,null,null,null,null,null,null,null,null,null,null,null,null,null,null,null,null,null,null,""]
[null,null,null,null,null,null,null,null,null,null,null,null,null,null,null,null,null,{"$f":"IFERROR(VLOOKUP(CONCATENATE($C$4,\"11\"),RS!$B$3:$R$170,4,FALSE),\"\")","v":""},{"$f":"IFERROR(VLOOKUP(CONCATENATE($C$4,\"11\"),RS!$B$3:$R$170,9,FALSE),\"\")","v":""},null,null,null,null,null,null,null,null,null,null,null,null,null,null,null,null,null,null,null,null,null,null,null,null,null,""]
[null,null,null,null,null,null,null,null,null,null,null,null,null,null,null,null,null,{"$f":"IFERROR(VLOOKUP(CONCATENATE($C$4,\"12\"),RS!$B$3:$R$170,4,FALSE),\"\")","v":"2021-12-20"},{"$f":"IFERROR(VLOOKUP(CONCATENATE($C$4,\"12\"),RS!$B$3:$R$170,9,FALSE),\"\")","v":7.58},null,null,null,null,null,null,null,null,null,null,null,null,null,null,null,null,null,null,null,null,null,null,null,null,null,""]
[]
[]
[]
[]
[null,null,null,null,null,null,null,null,null,null,null,null,"Grumlighet","FNU",null,null,null,"Årets resultat",null,null,null,null,null,null,null,null,null,null,null,null,null,null,null,null,null,null,null,null,null,null,null,null,null,"Årets resultat"]
[null,null,null,null,null,null,null,null,null,null,null,null,"(Turbiditet)",null,null,null,null,"Datum","FNU",null,null,null,null,null,null,null,null,null,null,null,null,null,null,null,null,null,null,null,null,null,null,null,null,"Datum","FNU"]
[null,null,null,null,null,null,null,null,null,null,null,null,"Medel",{"$f":"Statistik!H$73","v":34.543333333333337},null,null,null,{"$f":"IFERROR(VLOOKUP(CONCATENATE($C$4,\"1\"),RS!$B$3:$R$170,4,FALSE),\"\")","v":""},{"$f":"IFERROR(VLOOKUP(CONCATENATE($C$4,\"1\"),RS!$B$3:$R$170,10,FALSE),\"\")","v":""},null,null,null,null,null,null,null,null,null,null,null,null,null,null,null,null,null,null,null,null,null,null,null,null,null,""]
[null,null,null,null,null,null,null,null,null,null,null,null,"Std.avv.",{"$f":"Statistik!H$74","v":72.962858828047445},null,null,null,{"$f":"IFERROR(VLOOKUP(CONCATENATE($C$4,\"2\"),RS!$B$3:$R$170,4,FALSE),\"\")","v":"2021-02-15"},{"$f":"IFERROR(VLOOKUP(CONCATENATE($C$4,\"2\"),RS!$B$3:$R$170,10,FALSE),\"\")","v":12},null,null,null,null,null,null,null,null,null,null,null,null,null,null,null,null,null,null,null,null,null,null,null,null,"2021-02-15",12]
[null,null,null,null,null,null,null,null,null,null,null,null,"Max",{"$f":"Statistik!H$75","v":520},null,null,null,{"$f":"IFERROR(VLOOKUP(CONCATENATE($C$4,\"3\"),RS!$B$3:$R$170,4,FALSE),\"\")","v":""},{"$f":"IFERROR(VLOOKUP(CONCATENATE($C$4,\"3\"),RS!$B$3:$R$170,10,FALSE),\"\")","v":""},null,null,null,null,null,null,null,null,null,null,null,null,null,null,null,null,null,null,null,null,null,null,null,null,null,""]
[null,null,null,null,null,null,null,null,null,null,null,null,"Min",{"$f":"Statistik!H$76","v":3.2},null,null,null,{"$f":"IFERROR(VLOOKUP(CONCATENATE($C$4,\"4\"),RS!$B$3:$R$170,4,FALSE),\"\")","v":"2021-04-19"},{"$f":"IFERROR(VLOOKUP(CONCATENATE($C$4,\"4\"),RS!$B$3:$R$170,10,FALSE),\"\")","v":11},null,null,null,null,null,null,null,null,null,null,null,null,null,null,null,null,null,null,null,null,null,null,null,null,null,""]
[null,null,null,null,null,null,null,null,null,null,null,null,"Antal värden",{"$f":"Statistik!H$77","v":60},null,null,null,{"$f":"IFERROR(VLOOKUP(CONCATENATE($C$4,\"5\"),RS!$B$3:$R$170,4,FALSE),\"\")","v":""},{"$f":"IFERROR(VLOOKUP(CONCATENATE($C$4,\"5\"),RS!$B$3:$R$170,10,FALSE),\"\")","v":""},null,null,null,null,null,null,null,null,null,null,null,null,null,null,null,null,null,null,null,null,null,null,null,null,null,""]
[null,null,null,null,null,null,null,null,null,null,null,null,null,null,null,null,null,{"$f":"IFERROR(VLOOKUP(CONCATENATE($C$4,\"6\"),RS!$B$3:$R$170,4,FALSE),\"\")","v":"2021-06-15"},{"$f":"IFERROR(VLOOKUP(CONCATENATE($C$4,\"6\"),RS!$B$3:$R$170,10,FALSE),\"\")","v":18},null,null,null,null,null,null,null,null,null,null,null,null,null,null,null,null,null,null,null,null,null,null,null,null,null,""]
[null,null,null,null,null,null,null,null,null,null,null,null,"Senaste",{"$f":"VLOOKUP(TRIM(CONCATENATE($C$4,$R$4)),RS!$A$3:$R$170,11,FALSE)","v":20},null,null,null,{"$f":"IFERROR(VLOOKUP(CONCATENATE($C$4,\"7\"),RS!$B$3:$R$170,4,FALSE),\"\")","v":""},{"$f":"IFERROR(VLOOKUP(CONCATENATE($C$4,\"7\"),RS!$B$3:$R$170,10,FALSE),\"\")","v":""},null,null,null,null,null,null,null,null,null,null,null,null,null,null,null,null,null,null,null,null,null,null,null,null,null,""]
[null,null,null,null,null,null,null,null,null,null,null,null,null,null,null,null,null,{"$f":"IFERROR(VLOOKUP(CONCATENATE($C$4,\"8\"),RS!$B$3:$R$170,4,FALSE),\"\")","v":"2021-08-19"},{"$f":"IFERROR(VLOOKUP(CONCATENATE($C$4,\"8\"),RS!$B$3:$R$170,10,FALSE),\"\")","v":14},null,null,null,null,null,null,null,null,null,null,null,null,null,null,null,null,null,null,null,null,null,null,null,null,null,""]
[null,null,null,null,null,null,null,null,null,null,null,null,null,null,null,null,null,{"$f":"IFERROR(VLOOKUP(CONCATENATE($C$4,\"9\"),RS!$B$3:$R$170,4,FALSE),\"\")","v":""},{"$f":"IFERROR(VLOOKUP(CONCATENATE($C$4,\"9\"),RS!$B$3:$R$170,10,FALSE),\"\")","v":""},null,null,null,null,null,null,null,null,null,null,null,null,null,null,null,null,null,null,null,null,null,null,null,null,null,""]
[null,null,null,null,null,null,null,null,null,null,null,null,null,null,null,null,null,{"$f":"IFERROR(VLOOKUP(CONCATENATE($C$4,\"10\"),RS!$B$3:$R$170,4,FALSE),\"\")","v":"2021-10-20"},{"$f":"IFERROR(VLOOKUP(CONCATENATE($C$4,\"10\"),RS!$B$3:$R$170,10,FALSE),\"\")","v":76},null,null,null,null,null,null,null,null,null,null,null,null,null,null,null,null,null,null,null,null,null,null,null,null,null,""]
[null,null,null,null,null,null,null,null,null,null,null,null,null,null,null,null,null,{"$f":"IFERROR(VLOOKUP(CONCATENATE($C$4,\"11\"),RS!$B$3:$R$170,4,FALSE),\"\")","v":""},{"$f":"IFERROR(VLOOKUP(CONCATENATE($C$4,\"11\"),RS!$B$3:$R$170,10,FALSE),\"\")","v":""},null,null,null,null,null,null,null,null,null,null,null,null,null,null,null,null,null,null,null,null,null,null,null,null,null,""]
[null,null,null,null,null,null,null,null,null,null,null,null,null,null,null,null,null,{"$f":"IFERROR(VLOOKUP(CONCATENATE($C$4,\"12\"),RS!$B$3:$R$170,4,FALSE),\"\")","v":"2021-12-20"},{"$f":"IFERROR(VLOOKUP(CONCATENATE($C$4,\"12\"),RS!$B$3:$R$170,10,FALSE),\"\")","v":20},null,null,null,null,null,null,null,null,null,null,null,null,null,null,null,null,null,null,null,null,null,null,null,null,null,""]
[]
[]
[]
[]
[null,null,null,null,null,null,null,null,null,null,null,null,"BOD-7","mg/l",null,null,null,"Årets resultat",null,null,null,null,null,null,null,null,null,null,null,null,null,null,null,null,null,null,null,null,null,null,null,null,null,"Årets resultat"]
[null,null,null,null,null,null,null,null,null,null,null,null,null,null,null,null,null,"Datum","mg/l",null,null,null,null,null,null,null,null,null,null,null,null,null,null,null,null,null,null,null,null,null,null,null,null,"Datum","mg/l"]
[null,null,null,null,null,null,null,null,null,null,null,null,"Medel",{"$f":"Statistik!J$73","v":6.5305000000000009},null,null,null,{"$f":"IFERROR(VLOOKUP(CONCATENATE($C$4,\"1\"),RS!$B$3:$R$170,4,FALSE),\"\")","v":""},{"$f":"IFERROR(VLOOKUP(CONCATENATE($C$4,\"1\"),RS!$B$3:$R$170,12,FALSE),\"\")","v":""},null,null,null,null,null,null,null,null,null,null,null,null,null,null,null,null,null,null,null,null,null,null,null,null,null,""]
[null,null,null,null,null,null,null,null,null,null,null,null,"Std.avv.",{"$f":"Statistik!J$74","v":1.5824679556024048},null,null,null,{"$f":"IFERROR(VLOOKUP(CONCATENATE($C$4,\"2\"),RS!$B$3:$R$170,4,FALSE),\"\")","v":"2021-02-15"},{"$f":"IFERROR(VLOOKUP(CONCATENATE($C$4,\"2\"),RS!$B$3:$R$170,12,FALSE),\"\")","v":4.9000000000000004},null,null,null,null,null,null,null,null,null,null,null,null,null,null,null,null,null,null,null,null,null,null,null,null,"2021-02-15",4.9000000000000004]
[null,null,null,null,null,null,null,null,null,null,null,null,"Max",{"$f":"Statistik!J$75","v":9.8000000000000007},null,null,null,{"$f":"IFERROR(VLOOKUP(CONCATENATE($C$4,\"3\"),RS!$B$3:$R$170,4,FALSE),\"\")","v":""},{"$f":"IFERROR(VLOOKUP(CONCATENATE($C$4,\"3\"),RS!$B$3:$R$170,12,FALSE),\"\")","v":""},null,null,null,null,null,null,null,null,null,null,null,null,null,null,null,null,null,null,null,null,null,null,null,null,null,""]
[null,null,null,null,null,null,null,null,null,null,null,null,"Min",{"$f":"Statistik!J$76","v":2.1},null,null,null,{"$f":"IFERROR(VLOOKUP(CONCATENATE($C$4,\"4\"),RS!$B$3:$R$170,4,FALSE),\"\")","v":"2021-04-19"},{"$f":"IFERROR(VLOOKUP(CONCATENATE($C$4,\"4\"),RS!$B$3:$R$170,12,FALSE),\"\")","v":6.3},null,null,null,null,null,null,null,null,null,null,null,null,null,null,null,null,null,null,null,null,null,null,null,null,null,""]
[null,null,null,null,null,null,null,null,null,null,null,null,"Antal värden",{"$f":"Statistik!J$77","v":60},null,null,null,{"$f":"IFERROR(VLOOKUP(CONCATENATE($C$4,\"5\"),RS!$B$3:$R$170,4,FALSE),\"\")","v":""},{"$f":"IFERROR(VLOOKUP(CONCATENATE($C$4,\"5\"),RS!$B$3:$R$170,12,FALSE),\"\")","v":""},null,null,null,null,null,null,null,null,null,null,null,null,null,null,null,null,null,null,null,null,null,null,null,null,null,""]
[null,null,null,null,null,null,null,null,null,null,null,null,null,null,null,null,null,{"$f":"IFERROR(VLOOKUP(CONCATENATE($C$4,\"6\"),RS!$B$3:$R$170,4,FALSE),\"\")","v":"2021-06-15"},{"$f":"IFERROR(VLOOKUP(CONCATENATE($C$4,\"6\"),RS!$B$3:$R$170,12,FALSE),\"\")","v":7.7},null,null,null,null,null,null,null,null,null,null,null,null,null,null,null,null,null,null,null,null,null,null,null,null,null,""]
[null,null,null,null,null,null,null,null,null,null,null,null,"Senaste",{"$f":"VLOOKUP(TRIM(CONCATENATE($C$4,$R$4)),RS!$A$3:$R$170,13,FALSE)","v":5.8},null,null,null,{"$f":"IFERROR(VLOOKUP(CONCATENATE($C$4,\"7\"),RS!$B$3:$R$170,4,FALSE),\"\")","v":""},{"$f":"IFERROR(VLOOKUP(CONCATENATE($C$4,\"7\"),RS!$B$3:$R$170,12,FALSE),\"\")","v":""},null,null,null,null,null,null,null,null,null,null,null,null,null,null,null,null,null,null,null,null,null,null,null,null,null,""]
[null,null,null,null,null,null,null,null,null,null,null,null,null,null,null,null,null,{"$f":"IFERROR(VLOOKUP(CONCATENATE($C$4,\"8\"),RS!$B$3:$R$170,4,FALSE),\"\")","v":"2021-08-19"},{"$f":"IFERROR(VLOOKUP(CONCATENATE($C$4,\"8\"),RS!$B$3:$R$170,12,FALSE),\"\")","v":5.6},null,null,null,null,null,null,null,null,null,null,null,null,null,null,null,null,null,null,null,null,null,null,null,null,null,""]
[null,null,null,null,null,null,null,null,null,null,null,null,null,null,null,null,null,{"$f":"IFERROR(VLOOKUP(CONCATENATE($C$4,\"9\"),RS!$B$3:$R$170,4,FALSE),\"\")","v":""},{"$f":"IFERROR(VLOOKUP(CONCATENATE($C$4,\"9\"),RS!$B$3:$R$170,12,FALSE),\"\")","v":""},null,null,null,null,null,null,null,null,null,null,null,null,null,null,null,null,null,null,null,null,null,null,null,null,null,""]
[null,null,null,null,null,null,null,null,null,null,null,null,null,null,null,null,null,{"$f":"IFERROR(VLOOKUP(CONCATENATE($C$4,\"10\"),RS!$B$3:$R$170,4,FALSE),\"\")","v":"2021-10-20"},{"$f":"IFERROR(VLOOKUP(CONCATENATE($C$4,\"10\"),RS!$B$3:$R$170,12,FALSE),\"\")","v":5.7},null,null,null,null,null,null,null,null,null,null,null,null,null,null,null,null,null,null,null,null,null,null,null,null,null,""]
[null,null,null,null,null,null,null,null,null,null,null,null,null,null,null,null,null,{"$f":"IFERROR(VLOOKUP(CONCATENATE($C$4,\"11\"),RS!$B$3:$R$170,4,FALSE),\"\")","v":""},{"$f":"IFERROR(VLOOKUP(CONCATENATE($C$4,\"11\"),RS!$B$3:$R$170,12,FALSE),\"\")","v":""},null,null,null,null,null,null,null,null,null,null,null,null,null,null,null,null,null,null,null,null,null,null,null,null,null,""]
[null,null,null,null,null,null,null,null,null,null,null,null,null,null,null,null,null,{"$f":"IFERROR(VLOOKUP(CONCATENATE($C$4,\"12\"),RS!$B$3:$R$170,4,FALSE),\"\")","v":"2021-12-20"},{"$f":"IFERROR(VLOOKUP(CONCATENATE($C$4,\"12\"),RS!$B$3:$R$170,12,FALSE),\"\")","v":5.8},null,null,null,null,null,null,null,null,null,null,null,null,null,null,null,null,null,null,null,null,null,null,null,null,null,""]
[]
[]
[]
[]
[null,null,null,null,null,null,null,null,null,null,null,null,"Kond","mg/l",null,null,null,"Årets resultat",null,null,null,null,null,null,null,null,null,null,null,null,null,null,null,null,null,null,null,null,null,null,null,null,null,"Årets resultat"]
[null,null,null,null,null,null,null,null,null,null,null,null,null,null,null,null,null,"Datum","mS/m",null,null,null,null,null,null,null,null,null,null,null,null,null,null,null,null,null,null,null,null,null,null,null,null,"Datum","mS/m"]
[null,null,null,null,null,null,null,null,null,null,null,null,"Medel",{"$f":"Statistik!I$73","v":43.528333333333343},null,null,null,{"$f":"IFERROR(VLOOKUP(CONCATENATE($C$4,\"1\"),RS!$B$3:$R$170,4,FALSE),\"\")","v":""},{"$f":"IFERROR(VLOOKUP(CONCATENATE($C$4,\"1\"),RS!$B$3:$R$170,11,FALSE),\"\")","v":""},null,null,null,null,null,null,null,null,null,null,null,null,null,null,null,null,null,null,null,null,null,null,null,null,null,""]
[null,null,null,null,null,null,null,null,null,null,null,null,"Std.avv.",{"$f":"Statistik!I$74","v":6.1609236503942721},null,null,null,{"$f":"IFERROR(VLOOKUP(CONCATENATE($C$4,\"2\"),RS!$B$3:$R$170,4,FALSE),\"\")","v":"2021-02-15"},{"$f":"IFERROR(VLOOKUP(CONCATENATE($C$4,\"2\"),RS!$B$3:$R$170,11,FALSE),\"\")","v":50.4},null,null,null,null,null,null,null,null,null,null,null,null,null,null,null,null,null,null,null,null,null,null,null,null,"2021-02-15",50.4]
[null,null,null,null,null,null,null,null,null,null,null,null,"Max",{"$f":"Statistik!I$75","v":80.599999999999994},null,null,null,{"$f":"IFERROR(VLOOKUP(CONCATENATE($C$4,\"3\"),RS!$B$3:$R$170,4,FALSE),\"\")","v":""},{"$f":"IFERROR(VLOOKUP(CONCATENATE($C$4,\"3\"),RS!$B$3:$R$170,11,FALSE),\"\")","v":""},null,null,null,null,null,null,null,null,null,null,null,null,null,null,null,null,null,null,null,null,null,null,null,null,null,""]
[null,null,null,null,null,null,null,null,null,null,null,null,"Min",{"$f":"Statistik!I$76","v":32.5},null,null,null,{"$f":"IFERROR(VLOOKUP(CONCATENATE($C$4,\"4\"),RS!$B$3:$R$170,4,FALSE),\"\")","v":"2021-04-19"},{"$f":"IFERROR(VLOOKUP(CONCATENATE($C$4,\"4\"),RS!$B$3:$R$170,11,FALSE),\"\")","v":47.7},null,null,null,null,null,null,null,null,null,null,null,null,null,null,null,null,null,null,null,null,null,null,null,null,null,""]
[null,null,null,null,null,null,null,null,null,null,null,null,"Antal värden",{"$f":"Statistik!I$77","v":60},null,null,null,{"$f":"IFERROR(VLOOKUP(CONCATENATE($C$4,\"5\"),RS!$B$3:$R$170,4,FALSE),\"\")","v":""},{"$f":"IFERROR(VLOOKUP(CONCATENATE($C$4,\"5\"),RS!$B$3:$R$170,11,FALSE),\"\")","v":""},null,null,null,null,null,null,null,null,null,null,null,null,null,null,null,null,null,null,null,null,null,null,null,null,null,""]
[null,null,null,null,null,null,null,null,null,null,null,null,null,null,null,null,null,{"$f":"IFERROR(VLOOKUP(CONCATENATE($C$4,\"6\"),RS!$B$3:$R$170,4,FALSE),\"\")","v":"2021-06-15"},{"$f":"IFERROR(VLOOKUP(CONCATENATE($C$4,\"6\"),RS!$B$3:$R$170,11,FALSE),\"\")","v":45.3},null,null,null,null,null,null,null,null,null,null,null,null,null,null,null,null,null,null,null,null,null,null,null,null,null,""]
[null,null,null,null,null,null,null,null,null,null,null,null,"Senaste",{"$f":"VLOOKUP(TRIM(CONCATENATE($C$4,$R$4)),RS!$A$3:$R$170,12,FALSE)","v":45.8},null,null,null,{"$f":"IFERROR(VLOOKUP(CONCATENATE($C$4,\"7\"),RS!$B$3:$R$170,4,FALSE),\"\")","v":""},{"$f":"IFERROR(VLOOKUP(CONCATENATE($C$4,\"7\"),RS!$B$3:$R$170,11,FALSE),\"\")","v":""},null,null,null,null,null,null,null,null,null,null,null,null,null,null,null,null,null,null,null,null,null,null,null,null,null,""]
[null,null,null,null,null,null,null,null,null,null,null,null,null,null,null,null,null,{"$f":"IFERROR(VLOOKUP(CONCATENATE($C$4,\"8\"),RS!$B$3:$R$170,4,FALSE),\"\")","v":"2021-08-19"},{"$f":"IFERROR(VLOOKUP(CONCATENATE($C$4,\"8\"),RS!$B$3:$R$170,11,FALSE),\"\")","v":50.2},null,null,null,null,null,null,null,null,null,null,null,null,null,null,null,null,null,null,null,null,null,null,null,null,null,""]
[null,null,null,null,null,null,null,null,null,null,null,null,null,null,null,null,null,{"$f":"IFERROR(VLOOKUP(CONCATENATE($C$4,\"9\"),RS!$B$3:$R$170,4,FALSE),\"\")","v":""},{"$f":"IFERROR(VLOOKUP(CONCATENATE($C$4,\"9\"),RS!$B$3:$R$170,11,FALSE),\"\")","v":""},null,null,null,null,null,null,null,null,null,null,null,null,null,null,null,null,null,null,null,null,null,null,null,null,null,""]
[null,null,null,null,null,null,null,null,null,null,null,null,null,null,null,null,null,{"$f":"IFERROR(VLOOKUP(CONCATENATE($C$4,\"10\"),RS!$B$3:$R$170,4,FALSE),\"\")","v":"2021-10-20"},{"$f":"IFERROR(VLOOKUP(CONCATENATE($C$4,\"10\"),RS!$B$3:$R$170,11,FALSE),\"\")","v":54.5},null,null,null,null,null,null,null,null,null,null,null,null,null,null,null,null,null,null,null,null,null,null,null,null,null,""]
[null,null,null,null,null,null,null,null,null,null,null,null,null,null,null,null,null,{"$f":"IFERROR(VLOOKUP(CONCATENATE($C$4,\"11\"),RS!$B$3:$R$170,4,FALSE),\"\")","v":""},{"$f":"IFERROR(VLOOKUP(CONCATENATE($C$4,\"11\"),RS!$B$3:$R$170,11,FALSE),\"\")","v":""},null,null,null,null,null,null,null,null,null,null,null,null,null,null,null,null,null,null,null,null,null,null,null,null,null,""]
[null,null,null,null,null,null,null,null,null,null,null,null,null,null,null,null,null,{"$f":"IFERROR(VLOOKUP(CONCATENATE($C$4,\"12\"),RS!$B$3:$R$170,4,FALSE),\"\")","v":"2021-12-20"},{"$f":"IFERROR(VLOOKUP(CONCATENATE($C$4,\"12\"),RS!$B$3:$R$170,11,FALSE),\"\")","v":45.8},null,null,null,null,null,null,null,null,null,null,null,null,null,null,null,null,null,null,null,null,null,null,null,null,null,""]
[]
[]
[]
[]
[null,null,null,null,null,null,null,null,null,null,null,null,"NO2,3-N","µg/l",null,null,null,"Årets resultat",null,null,null,null,null,null,null,null,null,null,null,null,null,null,null,null,null,null,null,null,null,null,null,null,null,"Årets resultat"]
[null,null,null,null,null,null,null,null,null,null,null,null,null,null,null,null,null,"Datum","µg/l",null,null,null,null,null,null,null,null,null,null,null,null,null,null,null,null,null,null,null,null,null,null,null,null,"Datum","µg/l"]
[null,null,null,null,null,null,null,null,null,null,null,null,"Medel",{"$f":"Statistik!M$73","v":1820.8},null,null,null,{"$f":"IFERROR(VLOOKUP(CONCATENATE($C$4,\"1\"),RS!$B$3:$R$170,4,FALSE),\"\")","v":""},{"$f":"IFERROR(VLOOKUP(CONCATENATE($C$4,\"1\"),RS!$B$3:$R$170,15,FALSE),\"\")","v":""},null,null,null,null,null,null,null,null,null,null,null,null,null,null,null,null,null,null,null,null,null,null,null,null,null,""]
[null,null,null,null,null,null,null,null,null,null,null,null,"Std.avv.",{"$f":"Statistik!M$74","v":2699.5602454185141},null,null,null,{"$f":"IFERROR(VLOOKUP(CONCATENATE($C$4,\"2\"),RS!$B$3:$R$170,4,FALSE),\"\")","v":"2021-02-15"},{"$f":"IFERROR(VLOOKUP(CONCATENATE($C$4,\"2\"),RS!$B$3:$R$170,15,FALSE),\"\")","v":1800},null,null,null,null,null,null,null,null,null,null,null,null,null,null,null,null,null,null,null,null,null,null,null,null,"2021-02-15",1800]
[null,null,null,null,null,null,null,null,null,null,null,null,"Max",{"$f":"Statistik!M$75","v":19000},null,null,null,{"$f":"IFERROR(VLOOKUP(CONCATENATE($C$4,\"3\"),RS!$B$3:$R$170,4,FALSE),\"\")","v":""},{"$f":"IFERROR(VLOOKUP(CONCATENATE($C$4,\"3\"),RS!$B$3:$R$170,15,FALSE),\"\")","v":""},null,null,null,null,null,null,null,null,null,null,null,null,null,null,null,null,null,null,null,null,null,null,null,null,null,""]
[null,null,null,null,null,null,null,null,null,null,null,null,"Min",{"$f":"Statistik!M$76","v":58},null,null,null,{"$f":"IFERROR(VLOOKUP(CONCATENATE($C$4,\"4\"),RS!$B$3:$R$170,4,FALSE),\"\")","v":"2021-04-19"},{"$f":"IFERROR(VLOOKUP(CONCATENATE($C$4,\"4\"),RS!$B$3:$R$170,15,FALSE),\"\")","v":1300},null,null,null,null,null,null,null,null,null,null,null,null,null,null,null,null,null,null,null,null,null,null,null,null,null,""]
[null,null,null,null,null,null,null,null,null,null,null,null,"Antal värden",{"$f":"Statistik!M$77","v":60},null,null,null,{"$f":"IFERROR(VLOOKUP(CONCATENATE($C$4,\"5\"),RS!$B$3:$R$170,4,FALSE),\"\")","v":""},{"$f":"IFERROR(VLOOKUP(CONCATENATE($C$4,\"5\"),RS!$B$3:$R$170,15,FALSE),\"\")","v":""},null,null,null,null,null,null,null,null,null,null,null,null,null,null,null,null,null,null,null,null,null,null,null,null,null,""]
[null,null,null,null,null,null,null,null,null,null,null,null,null,null,null,null,null,{"$f":"IFERROR(VLOOKUP(CONCATENATE($C$4,\"6\"),RS!$B$3:$R$170,4,FALSE),\"\")","v":"2021-06-15"},{"$f":"IFERROR(VLOOKUP(CONCATENATE($C$4,\"6\"),RS!$B$3:$R$170,15,FALSE),\"\")","v":590},null,null,null,null,null,null,null,null,null,null,null,null,null,null,null,null,null,null,null,null,null,null,null,null,null,""]
[null,null,null,null,null,null,null,null,null,null,null,null,"Senaste",{"$f":"VLOOKUP(TRIM(CONCATENATE($C$4,$R$4)),RS!$A$3:$R$170,16,FALSE)","v":1900},null,null,null,{"$f":"IFERROR(VLOOKUP(CONCATENATE($C$4,\"7\"),RS!$B$3:$R$170,4,FALSE),\"\")","v":""},{"$f":"IFERROR(VLOOKUP(CONCATENATE($C$4,\"7\"),RS!$B$3:$R$170,15,FALSE),\"\")","v":""},null,null,null,null,null,null,null,null,null,null,null,null,null,null,null,null,null,null,null,null,null,null,null,null,null,""]
[null,null,null,null,null,null,null,null,null,null,null,null,null,null,null,null,null,{"$f":"IFERROR(VLOOKUP(CONCATENATE($C$4,\"8\"),RS!$B$3:$R$170,4,FALSE),\"\")","v":"2021-08-19"},{"$f":"IFERROR(VLOOKUP(CONCATENATE($C$4,\"8\"),RS!$B$3:$R$170,15,FALSE),\"\")","v":1100},null,null,null,null,null,null,null,null,null,null,null,null,null,null,null,null,null,null,null,null,null,null,null,null,null,""]
[null,null,null,null,null,null,null,null,null,null,null,null,null,null,null,null,null,{"$f":"IFERROR(VLOOKUP(CONCATENATE($C$4,\"9\"),RS!$B$3:$R$170,4,FALSE),\"\")","v":""},{"$f":"IFERROR(VLOOKUP(CONCATENATE($C$4,\"9\"),RS!$B$3:$R$170,15,FALSE),\"\")","v":""},null,null,null,null,null,null,null,null,null,null,null,null,null,null,null,null,null,null,null,null,null,null,null,null,null,""]
[null,null,null,null,null,null,null,null,null,null,null,null,null,null,null,null,null,{"$f":"IFERROR(VLOOKUP(CONCATENATE($C$4,\"10\"),RS!$B$3:$R$170,4,FALSE),\"\")","v":"2021-10-20"},{"$f":"IFERROR(VLOOKUP(CONCATENATE($C$4,\"10\"),RS!$B$3:$R$170,15,FALSE),\"\")","v":5600},null,null,null,null,null,null,null,null,null,null,null,null,null,null,null,null,null,null,null,null,null,null,null,null,null,""]
[null,null,null,null,null,null,null,null,null,null,null,null,null,null,null,null,null,{"$f":"IFERROR(VLOOKUP(CONCATENATE($C$4,\"11\"),RS!$B$3:$R$170,4,FALSE),\"\")","v":""},{"$f":"IFERROR(VLOOKUP(CONCATENATE($C$4,\"11\"),RS!$B$3:$R$170,15,FALSE),\"\")","v":""},null,null,null,null,null,null,null,null,null,null,null,null,null,null,null,null,null,null,null,null,null,null,null,null,null,""]
[null,null,null,null,null,null,null,null,null,null,null,null,null,null,null,null,null,{"$f":"IFERROR(VLOOKUP(CONCATENATE($C$4,\"12\"),RS!$B$3:$R$170,4,FALSE),\"\")","v":"2021-12-20"},{"$f":"IFERROR(VLOOKUP(CONCATENATE($C$4,\"12\"),RS!$B$3:$R$170,15,FALSE),\"\")","v":1900},null,null,null,null,null,null,null,null,null,null,null,null,null,null,null,null,null,null,null,null,null,null,null,null,null,""]
[]
[]
[]
[]
[null,null,null,null,null,null,null,null,null,null,null,null,"NH4-N","µg/l",null,null,null,"Årets resultat",null,null,null,null,null,null,null,null,null,null,null,null,null,null,null,null,null,null,null,null,null,null,null,null,null,"Årets resultat"]
[null,null,null,null,null,null,null,null,null,null,null,null,null,null,null,null,null,"Datum","µg/l",null,null,null,null,null,null,null,null,null,null,null,null,null,null,null,null,null,null,null,null,null,null,null,null,"Datum","µg/l"]
[null,null,null,null,null,null,null,null,null,null,null,null,"Medel",{"$f":"Statistik!N$73","v":130.94999999999999},null,null,null,{"$f":"IFERROR(VLOOKUP(CONCATENATE($C$4,\"1\"),RS!$B$3:$R$170,4,FALSE),\"\")","v":""},{"$f":"IFERROR(VLOOKUP(CONCATENATE($C$4,\"1\"),RS!$B$3:$R$170,16,FALSE),\"\")","v":""},null,null,null,null,null,null,null,null,null,null,null,null,null,null,null,null,null,null,null,null,null,null,null,null,null,""]
[null,null,null,null,null,null,null,null,null,null,null,null,"Std.avv.",{"$f":"Statistik!N$74","v":174.22218670130118},null,null,null,{"$f":"IFERROR(VLOOKUP(CONCATENATE($C$4,\"2\"),RS!$B$3:$R$170,4,FALSE),\"\")","v":"2021-02-15"},{"$f":"IFERROR(VLOOKUP(CONCATENATE($C$4,\"2\"),RS!$B$3:$R$170,16,FALSE),\"\")","v":250},null,null,null,null,null,null,null,null,null,null,null,null,null,null,null,null,null,null,null,null,null,null,null,null,"2021-02-15",250]
[null,null,null,null,null,null,null,null,null,null,null,null,"Max",{"$f":"Statistik!N$75","v":770},null,null,null,{"$f":"IFERROR(VLOOKUP(CONCATENATE($C$4,\"3\"),RS!$B$3:$R$170,4,FALSE),\"\")","v":""},{"$f":"IFERROR(VLOOKUP(CONCATENATE($C$4,\"3\"),RS!$B$3:$R$170,16,FALSE),\"\")","v":""},null,null,null,null,null,null,null,null,null,null,null,null,null,null,null,null,null,null,null,null,null,null,null,null,null,""]
[null,null,null,null,null,null,null,null,null,null,null,null,"Min",{"$f":"Statistik!N$76","v":10},null,null,null,{"$f":"IFERROR(VLOOKUP(CONCATENATE($C$4,\"4\"),RS!$B$3:$R$170,4,FALSE),\"\")","v":"2021-04-19"},{"$f":"IFERROR(VLOOKUP(CONCATENATE($C$4,\"4\"),RS!$B$3:$R$170,16,FALSE),\"\")","v":"<10"},null,null,null,null,null,null,null,null,null,null,null,null,null,null,null,null,null,null,null,null,null,null,null,null,null,""]
[null,null,null,null,null,null,null,null,null,null,null,null,"Antal värden",{"$f":"Statistik!N$77","v":60},null,null,null,{"$f":"IFERROR(VLOOKUP(CONCATENATE($C$4,\"5\"),RS!$B$3:$R$170,4,FALSE),\"\")","v":""},{"$f":"IFERROR(VLOOKUP(CONCATENATE($C$4,\"5\"),RS!$B$3:$R$170,16,FALSE),\"\")","v":""},null,null,null,null,null,null,null,null,null,null,null,null,null,null,null,null,null,null,null,null,null,null,null,null,null,""]
[null,null,null,null,null,null,null,null,null,null,null,null,null,null,null,null,null,{"$f":"IFERROR(VLOOKUP(CONCATENATE($C$4,\"6\"),RS!$B$3:$R$170,4,FALSE),\"\")","v":"2021-06-15"},{"$f":"IFERROR(VLOOKUP(CONCATENATE($C$4,\"6\"),RS!$B$3:$R$170,16,FALSE),\"\")","v":250},null,null,null,null,null,null,null,null,null,null,null,null,null,null,null,null,null,null,null,null,null,null,null,null,null,""]
[null,null,null,null,null,null,null,null,null,null,null,null,"Senaste",{"$f":"VLOOKUP(TRIM(CONCATENATE($C$4,$R$4)),RS!$A$3:$R$170,17,FALSE)","v":650},null,null,null,{"$f":"IFERROR(VLOOKUP(CONCATENATE($C$4,\"7\"),RS!$B$3:$R$170,4,FALSE),\"\")","v":""},{"$f":"IFERROR(VLOOKUP(CONCATENATE($C$4,\"7\"),RS!$B$3:$R$170,16,FALSE),\"\")","v":""},null,null,null,null,null,null,null,null,null,null,null,null,null,null,null,null,null,null,null,null,null,null,null,null,null,""]
[null,null,null,null,null,null,null,null,null,null,null,null,null,null,null,null,null,{"$f":"IFERROR(VLOOKUP(CONCATENATE($C$4,\"8\"),RS!$B$3:$R$170,4,FALSE),\"\")","v":"2021-08-19"},{"$f":"IFERROR(VLOOKUP(CONCATENATE($C$4,\"8\"),RS!$B$3:$R$170,16,FALSE),\"\")","v":130},null,null,null,null,null,null,null,null,null,null,null,null,null,null,null,null,null,null,null,null,null,null,null,null,null,""]
[null,null,null,null,null,null,null,null,null,null,null,null,null,null,null,null,null,{"$f":"IFERROR(VLOOKUP(CONCATENATE($C$4,\"9\"),RS!$B$3:$R$170,4,FALSE),\"\")","v":""},{"$f":"IFERROR(VLOOKUP(CONCATENATE($C$4,\"9\"),RS!$B$3:$R$170,16,FALSE),\"\")","v":""},null,null,null,null,null,null,null,null,null,null,null,null,null,null,null,null,null,null,null,null,null,null,null,null,null,""]
[null,null,null,null,null,null,null,null,null,null,null,null,null,null,null,null,null,{"$f":"IFERROR(VLOOKUP(CONCATENATE($C$4,\"10\"),RS!$B$3:$R$170,4,FALSE),\"\")","v":"2021-10-20"},{"$f":"IFERROR(VLOOKUP(CONCATENATE($C$4,\"10\"),RS!$B$3:$R$170,16,FALSE),\"\")","v":48},null,null,null,null,null,null,null,null,null,null,null,null,null,null,null,null,null,null,null,null,null,null,null,null,null,""]
[null,null,null,null,null,null,null,null,null,null,null,null,null,null,null,null,null,{"$f":"IFERROR(VLOOKUP(CONCATENATE($C$4,\"11\"),RS!$B$3:$R$170,4,FALSE),\"\")","v":""},{"$f":"IFERROR(VLOOKUP(CONCATENATE($C$4,\"11\"),RS!$B$3:$R$170,16,FALSE),\"\")","v":""},null,null,null,null,null,null,null,null,null,null,null,null,null,null,null,null,null,null,null,null,null,null,null,null,null,""]
[null,null,null,null,null,null,null,null,null,null,null,null,null,null,null,null,null,{"$f":"IFERROR(VLOOKUP(CONCATENATE($C$4,\"12\"),RS!$B$3:$R$170,4,FALSE),\"\")","v":"2021-12-20"},{"$f":"IFERROR(VLOOKUP(CONCATENATE($C$4,\"12\"),RS!$B$3:$R$170,16,FALSE),\"\")","v":650},null,null,null,null,null,null,null,null,null,null,null,null,null,null,null,null,null,null,null,null,null,null,null,null,null,""]
[]
[]
[]
[]
[null,null,null,null,null,null,null,null,null,null,null,null,"TOC","mg/l",null,null,null,"Årets resultat",null,null,null,null,null,null,null,null,null,null,null,null,null,null,null,null,null,null,null,null,null,null,null,null,null,"Årets resultat"]
[null,null,null,null,null,null,null,null,null,null,null,null,null,null,null,null,null,"Datum","mg/l",null,null,null,null,null,null,null,null,null,null,null,null,null,null,null,null,null,null,null,null,null,null,null,null,"Datum","µg/l"]
[null,null,null,null,null,null,null,null,null,null,null,null,"Medel",{"$f":"Statistik!K$73","v":21.316666666666666},null,null,null,{"$f":"IFERROR(VLOOKUP(CONCATENATE($C$4,\"1\"),RS!$B$3:$R$170,4,FALSE),\"\")","v":""},{"$f":"IFERROR(VLOOKUP(CONCATENATE($C$4,\"1\"),RS!$B$3:$R$170,13,FALSE),\"\")","v":""},null,null,null,null,null,null,null,null,null,null,null,null,null,null,null,null,null,null,null,null,null,null,null,null,null,""]
[null,null,null,null,null,null,null,null,null,null,null,null,"Std.avv.",{"$f":"Statistik!K$74","v":3.9078003985365304},null,null,null,{"$f":"IFERROR(VLOOKUP(CONCATENATE($C$4,\"2\"),RS!$B$3:$R$170,4,FALSE),\"\")","v":"2021-02-15"},{"$f":"IFERROR(VLOOKUP(CONCATENATE($C$4,\"2\"),RS!$B$3:$R$170,13,FALSE),\"\")","v":22},null,null,null,null,null,null,null,null,null,null,null,null,null,null,null,null,null,null,null,null,null,null,null,null,"2021-02-15",22]
[null,null,null,null,null,null,null,null,null,null,null,null,"Max",{"$f":"Statistik!K$75","v":32},null,null,null,{"$f":"IFERROR(VLOOKUP(CONCATENATE($C$4,\"3\"),RS!$B$3:$R$170,4,FALSE),\"\")","v":""},{"$f":"IFERROR(VLOOKUP(CONCATENATE($C$4,\"3\"),RS!$B$3:$R$170,13,FALSE),\"\")","v":""},null,null,null,null,null,null,null,null,null,null,null,null,null,null,null,null,null,null,null,null,null,null,null,null,null,""]
[null,null,null,null,null,null,null,null,null,null,null,null,"Min",{"$f":"Statistik!K$76","v":15},null,null,null,{"$f":"IFERROR(VLOOKUP(CONCATENATE($C$4,\"4\"),RS!$B$3:$R$170,4,FALSE),\"\")","v":"2021-04-19"},{"$f":"IFERROR(VLOOKUP(CONCATENATE($C$4,\"4\"),RS!$B$3:$R$170,13,FALSE),\"\")","v":22},null,null,null,null,null,null,null,null,null,null,null,null,null,null,null,null,null,null,null,null,null,null,null,null,null,""]
[null,null,null,null,null,null,null,null,null,null,null,null,"Antal värden",{"$f":"Statistik!K$77","v":60},null,null,null,{"$f":"IFERROR(VLOOKUP(CONCATENATE($C$4,\"5\"),RS!$B$3:$R$170,4,FALSE),\"\")","v":""},{"$f":"IFERROR(VLOOKUP(CONCATENATE($C$4,\"5\"),RS!$B$3:$R$170,13,FALSE),\"\")","v":""},null,null,null,null,null,null,null,null,null,null,null,null,null,null,null,null,null,null,null,null,null,null,null,null,null,""]
[null,null,null,null,null,null,null,null,null,null,null,null,null,null,null,null,null,{"$f":"IFERROR(VLOOKUP(CONCATENATE($C$4,\"6\"),RS!$B$3:$R$170,4,FALSE),\"\")","v":"2021-06-15"},{"$f":"IFERROR(VLOOKUP(CONCATENATE($C$4,\"6\"),RS!$B$3:$R$170,13,FALSE),\"\")","v":26},null,null,null,null,null,null,null,null,null,null,null,null,null,null,null,null,null,null,null,null,null,null,null,null,null,""]
[null,null,null,null,null,null,null,null,null,null,null,null,"Senaste",{"$f":"VLOOKUP(TRIM(CONCATENATE($C$4,$R$4)),RS!$A$3:$R$170,14,FALSE)","v":24},null,null,null,{"$f":"IFERROR(VLOOKUP(CONCATENATE($C$4,\"7\"),RS!$B$3:$R$170,4,FALSE),\"\")","v":""},{"$f":"IFERROR(VLOOKUP(CONCATENATE($C$4,\"7\"),RS!$B$3:$R$170,13,FALSE),\"\")","v":""},null,null,null,null,null,null,null,null,null,null,null,null,null,null,null,null,null,null,null,null,null,null,null,null,null,""]
[null,null,null,null,null,null,null,null,null,null,null,null,null,null,null,null,null,{"$f":"IFERROR(VLOOKUP(CONCATENATE($C$4,\"8\"),RS!$B$3:$R$170,4,FALSE),\"\")","v":"2021-08-19"},{"$f":"IFERROR(VLOOKUP(CONCATENATE($C$4,\"8\"),RS!$B$3:$R$170,13,FALSE),\"\")","v":22},null,null,null,null,null,null,null,null,null,null,null,null,null,null,null,null,null,null,null,null,null,null,null,null,null,""]
[null,null,null,null,null,null,null,null,null,null,null,null,null,null,null,null,null,{"$f":"IFERROR(VLOOKUP(CONCATENATE($C$4,\"9\"),RS!$B$3:$R$170,4,FALSE),\"\")","v":""},{"$f":"IFERROR(VLOOKUP(CONCATENATE($C$4,\"9\"),RS!$B$3:$R$170,13,FALSE),\"\")","v":""},null,null,null,null,null,null,null,null,null,null,null,null,null,null,null,null,null,null,null,null,null,null,null,null,null,""]
[null,null,null,null,null,null,null,null,null,null,null,null,null,null,null,null,null,{"$f":"IFERROR(VLOOKUP(CONCATENATE($C$4,\"10\"),RS!$B$3:$R$170,4,FALSE),\"\")","v":"2021-10-20"},{"$f":"IFERROR(VLOOKUP(CONCATENATE($C$4,\"10\"),RS!$B$3:$R$170,13,FALSE),\"\")","v":21},null,null,null,null,null,null,null,null,null,null,null,null,null,null,null,null,null,null,null,null,null,null,null,null,null,""]
[null,null,null,null,null,null,null,null,null,null,null,null,null,null,null,null,null,{"$f":"IFERROR(VLOOKUP(CONCATENATE($C$4,\"11\"),RS!$B$3:$R$170,4,FALSE),\"\")","v":""},{"$f":"IFERROR(VLOOKUP(CONCATENATE($C$4,\"11\"),RS!$B$3:$R$170,13,FALSE),\"\")","v":""},null,null,null,null,null,null,null,null,null,null,null,null,null,null,null,null,null,null,null,null,null,null,null,null,null,""]
[null,null,null,null,null,null,null,null,null,null,null,null,null,null,null,null,null,{"$f":"IFERROR(VLOOKUP(CONCATENATE($C$4,\"12\"),RS!$B$3:$R$170,4,FALSE),\"\")","v":"2021-12-20"},{"$f":"IFERROR(VLOOKUP(CONCATENATE($C$4,\"12\"),RS!$B$3:$R$170,13,FALSE),\"\")","v":24},null,null,null,null,null,null,null,null,null,null,null,null,null,null,null,null,null,null,null,null,null,null,null,null,null,""]

{"sheet":"Hist_data","index":8,"n_rows":792,"n_cols":18,"rows_kept":792,"cut":false,"hidden":true,"merged":[]}
[null,null,"sista rad",1084,"OBS! Om det blir fler än 2000 rader måste makro ändras"]
[null,"Sege å"]
[null,"Vattenkontroll - historiska data"]
[null,null,null,"  °C","mg/l","%",null,"  FNU","mS/m","mg/l"," mg/l"," µg/l","  µg/l","  µg/l","  µg/l"]
["Sorterings-","Provtagningspunkt","Datum"," Temp"," Syreh","Syrem","  pH","Gruml","  Kond","BOD7","TOC","Tot-P"," NO3+2-N","NH4-N"," Tot-N","Anmärkning","år","månad"]
[null,"Denna rad ska vara tom"]
[3,"1  Sege å, vid Brännemölla, uppströms Svedala AR","2011-02-22",1.3,10.6,75.138706723078869,7.41,8.8000000000000007,39.799999999999997,5.8,21,61,1900,350,3400,"isfritt",{"$f":"YEAR(C7)","v":2011},{"$f":"MONTH(C7)","v":2}]
[3,"1  Sege å, vid Brännemölla, uppströms Svedala AR","2011-04-11",10.5,11.6,104.33957292161482,8.18,19,39.799999999999997,9.8000000000000007,22,120,940,72,3100,"gröngrumligt",2011,4]
[3,"1  Sege å, vid Brännemölla, uppströms Svedala AR","2011-06-21",18.5,10.8,115.34095101047319,8.6999999999999993,41,32.5,7.8,32,170,58,"<10",3700,"lågflöde, grumligt",2011,6]
[3,"1  Sege å, vid Brännemölla, uppströms Svedala AR","2011-08-16",16.399999999999999,7.6,77.836862481435361,7.36,25,40,5.8,31,140,1400,"<10",4000,"högflöde, grumligt",2011,8]
[3,"1  Sege å, vid Brännemölla, uppströms Svedala AR","2011-10-11",11,8.8000000000000007,80.085800496409462,7.49,17,45.1,6.8,31,99,1200,240,3400,"gröngrumligt",2011,10]
[3,"1  Sege å, vid Brännemölla, uppströms Svedala AR","2011-12-19",2.6,11.9,87.467087408850958,7.7,34,45.4,6.2,21,120,1500,770,4200,"gröngrumligt",2011,12]
[3,"1  Sege å, vid Brännemölla, uppströms Svedala AR","2012-02-13",1.2,12.3,86.943529489523584,7.5,13,46,6.6,21,58,1600,700,3600,"is i kanten",2012,2]
[3,"1  Sege å, vid Brännemölla, uppströms Svedala AR","2012-04-16",8,10.9,92.292424411882706,7.97,7.3,43,6.05,20,54,990,230,2700,"gröngrumligt",2012,4]
[3,"1  Sege å, vid Brännemölla, uppströms Svedala AR","2012-06-19",17.5,7.9,82.727109284405657,7.9,32,41.2,7,17,130,180,"<10",2800,"grumligt",2012,6]
[3,"1  Sege å, vid Brännemölla, uppströms Svedala AR","2012-08-20",21.1,6.6,74.007896950048774,7.82,23,38.200000000000003,7.6,26,130,530,"<10",2300,"grumligt",2012,8]
[3,"1  Sege å, vid Brännemölla, uppströms Svedala AR","2012-10-10",8.5,10.199999999999999,87.438386998784694,7.87,21,44.4,6.9,17,110,820,"<10",2700,"gröngrumligt",2012,10]
[3,"1  Sege å, vid Brännemölla, uppströms Svedala AR","2012-12-10",0.7,13.5,94.081807720653757,7.84,13,43.2,6.2,20,73,550,320,2800,"isfritt",2012,12]
[3,"1  Sege å, vid Brännemölla, uppströms Svedala AR","2013-02-18",1.3,12.2,86.480398303920964,7.6,7.5,42.2,2.6,17,36,2400,310,3800,"grumligt",2013,2]
[3,"1  Sege å, vid Brännemölla, uppströms Svedala AR","2013-04-15",8.8000000000000007,13.4,115.71704939600069,8,8.8000000000000007,43,5.7,17,44,1000,450,2800,null,2013,4]
[3,"1  Sege å, vid Brännemölla, uppströms Svedala AR","2013-06-17",19.2,10.1,109.32695993424065,7.8,34,40.6,8.33,22,130,140,"<10",2600,"gröngrumligt",2013,6]
[3,"1  Sege å, vid Brännemölla, uppströms Svedala AR","2013-08-20",16.399999999999999,7.6,77.836862481435361,7.5,19,36.799999999999997,8.4,17,150,280,17,2900,"gröngrumligt",2013,8]
[3,"1  Sege å, vid Brännemölla, uppströms Svedala AR","2013-10-14",12.1,7.5,70.002873846340592,7.49,22,40.4,9,21,210,380,"<10",4400,"gröngrumligt",2013,10]
[3,"1  Sege å, vid Brännemölla, uppströms Svedala AR","2013-12-12",4.7,12.4,96.46611715591618,7.58,25,52.6,4.2,20,96,7800,110,8000,"gröngrumligt",2013,12]
[3,"1  Sege å, vid Brännemölla, uppströms Svedala AR","2014-02-18",2.9,12.2,90.414544369343773,7.83,20,42.1,4.9000000000000004,15,89,2400,420,4200,"Högflöde",2014,2]
[3,"1  Sege å, vid Brännemölla, uppströms Svedala AR","2014-04-14",8.6999999999999993,11,94.759759336082269,8.15,18,42.9,7.2,20,62,1300,"<10",3000,"Måttligt flöde",2014,4]
[3,"1  Sege å, vid Brännemölla, uppströms Svedala AR","2014-06-11",18.100000000000001,4.7,49.80449554212629,7.63,19,41.7,7.5,17,23,660,220,3300,"Grumligt",2014,6]
[3,"1  Sege å, vid Brännemölla, uppströms Svedala AR","2014-08-18",15.1,7.3,72.768475809552925,7.53,17,40.4,7.7,22,160,420,47,3000,"Gröngrumligt",2014,8]
[3,"1  Sege å, vid Brännemölla, uppströms Svedala AR","2014-10-20",13,6.3,60.00362747295582,7.13,184,41.9,4.0999999999999996,21,46,6900,48,8100,"Högflöde, grumligt",2014,10]
[3,"1  Sege å, vid Brännemölla, uppströms Svedala AR","2014-12-10",4.0999999999999996,10.9,83.451308024374825,7.62,520,40.200000000000003,6.3,25,440,1900,410,4200,"Mkt lergumligt",2014,12]
[3,"1  Sege å, vid Brännemölla, uppströms Svedala AR","2015-02-10",2.2999999999999998,12.7,92.57661156981348,7.79,25,41,5.8,18,71,1700,480,3900,"grumligt",2015,2]
[3,"1  Sege å, vid Brännemölla, uppströms Svedala AR","2015-04-13",9.6,11.5,101.25115115884853,8.07,15,42.5,5.8,21,66,1700,"<10",3300,"grumligt",2015,4]
[3,"1  Sege å, vid Brännemölla, uppströms Svedala AR","2015-06-15",16.100000000000001,5.7,58.018736529197959,7.54,17,44.5,8.6,21,160,450,220,3300,"gröngrumligt",2015,6]
[3,"1  Sege å, vid Brännemölla, uppströms Svedala AR","2015-08-18",17.8,5.2,54.778360041394457,7.58,34,40.700000000000003,8.1,28,240,410,"<10",3700,"grumligt",2015,8]
[3,"1  Sege å, vid Brännemölla, uppströms Svedala AR","2015-10-19",9.5,8.9,78.171562764143133,7.65,25,41.9,6.2,19,120,430,19,2900,"grumligt",2015,10]
[3,"1  Sege å, vid Brännemölla, uppströms Svedala AR","2015-12-09",6,11,88.537098609352142,7.8,25,41.9,5.4,20,110,2200,22,4000,"grumligt",2015,12]
[3,"1  Sege å, vid Brännemölla, uppströms Svedala AR","2016-02-23",3.8,12.3,93.413372151615576,7.77,20,41.6,4.5,17,70,2700,170,3800,"grumligt",2016,2]
[3,"1  Sege å, vid Brännemölla, uppströms Svedala AR","2016-04-19",8.6999999999999993,10.8,93.036854620880789,7.92,21,46.3,6.6,18,82,1200,"<10",3000,"grumligt",2016,4]
[3,"1  Sege å, vid Brännemölla, uppströms Svedala AR","2016-06-15",17.3,8,83.440400096584924,7.75,32,41.8,7.2,20,150,500,"<10",3300,"grumligt",2016,6]
[3,"1  Sege å, vid Brännemölla, uppströms Svedala AR","2016-08-16",15.6,6.6,66.485787272612313,7.71,26,38.5,7,21,120,410,"<10",2600,"grumligt",2016,8]
[3,"1  Sege å, vid Brännemölla, uppströms Svedala AR","2016-10-17",8.6999999999999993,10.1,87.006688117675537,7.72,24,40.9,5,19,90,560,55,3100,"grumligt",2016,10]
[3,"1  Sege å, vid Brännemölla, uppströms Svedala AR","2016-12-15",2.1,12.6,91.339214092803275,7.67,15,45.9,5.2,17,50,2600,71,4100,"grumligt",2016,12]
[3,"1  Sege å, vid Brännemölla, uppströms Svedala AR","2017-02-21",4.5999999999999996,12,93.106946953025201,7.66,15,52.9,3.3,16,54,4500,230,5800,"grumligt",2017,2]
[3,"1  Sege å, vid Brännemölla, uppströms Svedala AR","2017-04-18",7,12,99.089702538874178,8.1199999999999992,20,44.7,9.1,20,68,1800,"<10",3800,"grumligt",2017,4]
[3,"1  Sege å, vid Brännemölla, uppströms Svedala AR","2017-06-21",18.5,6.3,67.282221422776018,7.81,28,40.700000000000003,7.6,23,140,270,32,2800,"grumligt",2017,6]
[3,"1  Sege å, vid Brännemölla, uppströms Svedala AR","2017-08-22",17.5,7.4,77.491216291721756,7.75,19,40.4,6.05,24,100,370,"<10",2900,null,2017,8]
[3,"1  Sege å, vid Brännemölla, uppströms Svedala AR","2017-10-17",12.5,9.6,90.417319687805247,7.81,22,41,7.1,23,70,760,"<10",3100,"grumligt",2017,10]
[3,"1  Sege å, vid Brännemölla, uppströms Svedala AR","2017-12-19",2,12.7,91.808272105756956,7.78,17,42.4,5.2,21,72,1600,160,3200,"högflöde",2017,12]
[3,"1  Sege å, vid Brännemölla, uppströms Svedala AR","2018-02-19",2.5,13.3,97.488064323437243,7.84,12,44.1,5.0999999999999996,18,53,1700,310,3100,null,2018,2]
[3,"1  Sege å, vid Brännemölla, uppströms Svedala AR","2018-04-16",10.6,11.7,105.48671926150379,7.83,19,43.1,6.7,17,54,1400,98,3000,"grumligt",2018,4]
[3,"1  Sege å, vid Brännemölla, uppströms Svedala AR","2018-06-20",18.100000000000001,9.1,96.429980730499835,7.83,17,41.2,5.5,19,130,1100,"<10",2800,"grumligt",2018,6]
[3,"1  Sege å, vid Brännemölla, uppströms Svedala AR","2018-08-17",19.899999999999999,6.8,74.585345584908168,7.7,14,36.299999999999997,7.8,24,120,940,27,3000,null,2018,8]
[3,"1  Sege å, vid Brännemölla, uppströms Svedala AR","2018-10-16",10.5,6.1,54.86822369153883,7.68,12,46.3,6.2,20,95,1500,"<10",3100,null,2018,10]
[3,"1  Sege å, vid Brännemölla, uppströms Svedala AR","2018-12-11",5.4,10.4,82.412083138517161,7.51,3.2,80.599999999999994,2.1,15,51,19000,140,19000,"klart vatten",2018,12]
[3,"1  Sege å, vid Brännemölla, uppströms Svedala AR","2019-02-20",4.8,11.9,93,7.73,15,47.5,5.3,23,64,4600,79,6100,null,2019,2]
[3,"1  Sege å, vid Brännemölla, uppströms Svedala AR","2019-04-16",7.3,12.2,102,8.18,19,44.8,7.7,21,20,2300,"<10",3100,null,2019,4]
[3,"1  Sege å, vid Brännemölla, uppströms Svedala AR","2019-06-18",18.2,6,64,7.71,16,40.5,9,20,110,700,28,3100,null,2019,6]
[3,"1  Sege å, vid Brännemölla, uppströms Svedala AR","2019-08-20",16.7,5.7,59,7.4,13,40.5,7.7,28,120,520,12,3200,null,2019,8]
[3,"1  Sege å, vid Brännemölla, uppströms Svedala AR","2019-10-16",11.6,6.6,61,7.51,24,49.5,7.1,24,110,2000,"<10",5000,null,2019,10]
[3,"1  Sege å, vid Brännemölla, uppströms Svedala AR","2019-12-11",4.7,11,86,7.68,236,43.3,8.3000000000000007,24,310,4100,170,6800,"grumligt",2019,12]
[3,"1  Sege å, vid Brännemölla, uppströms Svedala AR","2020-02-12",4.0999999999999996,12,92,7.82,31,45.9,6.8,23,110,2900,270,4900,"grumligt",2020,2]
[3,"1  Sege å, vid Brännemölla, uppströms Svedala AR","2020-04-20",9.9,11,98,7.87,21,48,8.3000000000000007,24,98,1200,"<10",3000,null,2020,4]
[3,"1  Sege å, vid Brännemölla, uppströms Svedala AR","2020-06-15",17.3,6.8,71,7.72,29,45,8.4,29,140,640,"<10",3300,"grumligt",2020,6]
[3,"1  Sege å, vid Brännemölla, uppströms Svedala AR","2020-08-18",20.399999999999999,3.7,41,7.34,14,42.6,6.9,26,130,720,120,3600,"grumligt",2020,8]
[3,"1  Sege å, vid Brännemölla, uppströms Svedala AR","2020-10-19",7.2,9.4,78,7.74,16,44.9,5.2,23,98,820,"<10",3300,"grumligt",2020,10]
[3,"1  Sege å, vid Brännemölla, uppströms Svedala AR","2020-12-14",4.4000000000000004,10.3,79,7.66,13,54.6,5.5,22,94,1700,200,3700,"grumligt",2020,12]
[5,"2  Sege å, söder Krågeholm, nedströms Svedala AR","2011-02-22",1.3,12,85.062686856315693,7.56,13,51.3,6.5,18,74,2400,470,4100,"isfritt",2011,2]
[5,"2  Sege å, söder Krågeholm, nedströms Svedala AR","2011-04-11",10.6,11.6,104.58512337037982,7.97,15,61.4,9.6999999999999993,16,110,1700,69,3700,"grumligt",2011,4]
[5,"2  Sege å, söder Krågeholm, nedströms Svedala AR","2011-06-21",16.7,9,92.741152544928724,7.79,26,49.2,7.9,25,190,1000,"<10",3500,"lågflöde",2011,6]
[5,"2  Sege å, söder Krågeholm, nedströms Svedala AR","2011-08-16",16.100000000000001,6.1,62.090226811948682,7.36,34,48.6,4,22,140,2300,"<10",4200,"högflöde, grumligt",2011,8]
[5,"2  Sege å, söder Krågeholm, nedströms Svedala AR","2011-10-11",11.5,8,73.652641975629479,7.47,44,54.2,6.4,22,160,2600,160,4400,"grumligt",{"$f":"YEAR(C71)","v":2011},{"$f":"MONTH(C71)","v":10}]
[5,"2  Sege å, söder Krågeholm, nedströms Svedala AR","2011-12-19",2.6,11.4,83.791999702596712,7.7,39,52.8,5.0999999999999996,20,95,2800,540,5100,"grumligt",2011,12]
[5,"2  Sege å, söder Krågeholm, nedströms Svedala AR","2012-02-13",1.5,12.5,89.10721644983272,7.6,14,67.5,7.2,17,66,2500,550,4000,"is i kanten",2012,2]
[5,"2  Sege å, söder Krågeholm, nedströms Svedala AR","2012-04-16",8.3000000000000007,10.7,91.274085468304676,7.88,8.5,51.9,5.9,17,57,1600,200,3200,"grumligt",2012,4]
[5,"2  Sege å, söder Krågeholm, nedströms Svedala AR","2012-06-19",15.6,8.4,84.61827471059749,7.9,15,73.5,5,12,110,1200,78,2800,"grumligt",2012,6]
[5,"2  Sege å, söder Krågeholm, nedströms Svedala AR","2012-08-20",18.7,6.9,73.97588664352017,7.83,15,69.8,7.6,18,130,1700,160,3300,"grumligt",2012,8]
[5,"2  Sege å, söder Krågeholm, nedströms Svedala AR","2012-10-10",10,9.4,83.556623533241876,7.79,5.3,323,2.8,6.1,61,1300,65,2100,"ganska klart vatten",2012,10]
[5,"2  Sege å, söder Krågeholm, nedströms Svedala AR","2012-12-10",1.6,12.7,90.787466931205429,7.85,16,63.6,6.5,17,90,1500,300,3200,"isfritt",2012,12]
[5,"2  Sege å, söder Krågeholm, nedströms Svedala AR","2013-02-18",2.1,12.4,89.889385297679425,7.7,8.6999999999999993,59.4,2.6,16,46,2700,260,4000,"grumligt",2013,2]
[5,"2  Sege å, söder Krågeholm, nedströms Svedala AR","2013-04-15",10.3,13,116.38203613315257,8,6.5,54.1,5.4,14,50,1700,270,3300,null,2013,4]
[5,"2  Sege å, söder Krågeholm, nedströms Svedala AR","2013-06-17",17.3,9,93.870450108658034,7.7,14,59,7,14,110,1400,190,3200,"grumligt",2013,6]
[5,"2  Sege å, söder Krågeholm, nedströms Svedala AR","2013-08-20",16.600000000000001,7,71.98535721870573,7.5,8.6,57.2,7,11,160,1400,48,2800,"ganska klart",2013,8]
[5,"2  Sege å, söder Krågeholm, nedströms Svedala AR","2013-10-14",12.4,6.8,63.901527525371137,7.41,8.5,39.200000000000003,7,7.9,110,1500,180,2800,null,2013,10]
[5,"2  Sege å, söder Krågeholm, nedströms Svedala AR","2013-12-12",4.9000000000000004,10.8,84.46462071734679,7.62,18,63.7,3.3,13,97,6900,62,8500,"grumligt",2013,12]
[5,"2  Sege å, söder Krågeholm, nedströms Svedala AR","2014-02-18",3.1,11.9,88.675125304908804,7.77,21,48.9,5,12,95,3300,350,4500,"Högflöde",2014,2]
[5,"2  Sege å, söder Krågeholm, nedströms Svedala AR","2014-04-14",9,10.199999999999999,88.513309410240311,7.84,13,46.5,6.3,14,81,1300,110,2700,"Måttligt flöde",2014,4]
[5,"2  Sege å, söder Krågeholm, nedströms Svedala AR","2014-06-11",17.100000000000001,6.6,68.562568796419185,7.61,12,63.7,7,13,200,1800,140,3700,"Grumligt",2014,6]
[5,"2  Sege å, söder Krågeholm, nedströms Svedala AR","2014-08-18",15.8,5.9,59.682500446303777,7.54,10,38.700000000000003,5,8.6,110,1300,56,1800,"Grumligt",2014,8]
[5,"2  Sege å, söder Krågeholm, nedströms Svedala AR","2014-10-20",13.2,7.4,70.793851310000761,7.28,380,33.200000000000003,3.9,17,580,3900,73,5400,"Högflöde, grumligt",2014,10]
[5,"2  Sege å, söder Krågeholm, nedströms Svedala AR","2014-12-10",5.5,10.199999999999999,81.038690650034923,7.61,30,54.6,5.3,17,84,2200,340,3700,"Grumligt",2014,12]
[5,"2  Sege å, söder Krågeholm, nedströms Svedala AR","2015-02-10",2.8,12.3,90.905916084179609,7.75,26,48.2,5.3,14,58,2400,360,4100,"grumligt",2015,2]
[5,"2  Sege å, söder Krågeholm, nedströms Svedala AR","2015-04-13",9.5,11.3,99.251534745485102,7.92,15,49.5,8,14,85,2400,460,3900,"grumligt",2015,4]
[5,"2  Sege å, söder Krågeholm, nedströms Svedala AR","2015-06-15",14.9,7.6,75.438412851584317,7.63,10,59.6,6.5,14,120,1700,210,3300,"grumligt",2015,6]
[5,"2  Sege å, söder Krågeholm, nedströms Svedala AR","2015-08-18",17,5.8,60.130689432527831,7.68,15,62.7,7.5,17,200,1400,31,3100,"grumligt",2015,8]
[5,"2  Sege å, söder Krågeholm, nedströms Svedala AR","2015-10-19",9.8000000000000007,8.5,75.197083869350365,7.61,12,54.8,5.5,13,150,1300,190,2900,"grumligt",2015,10]
[5,"2  Sege å, söder Krågeholm, nedströms Svedala AR","2015-12-09",6.7,10.6,86.86444315105112,7.77,24,48.5,5.2,18,120,3000,44,4500,"grumligt",2015,12]
[5,"2  Sege å, söder Krågeholm, nedströms Svedala AR","2016-02-23",4.4000000000000004,11.7,90.297470735073119,7.7,42,48.2,4.5999999999999996,13,100,3900,210,4800,"grumligt",2016,2]
[5,"2  Sege å, söder Krågeholm, nedströms Svedala AR","2016-04-19",9.5,11,96.616538247817346,7.91,12,62,5.8,13,100,2700,130,3800,"grumligt",2016,4]
[5,"2  Sege å, söder Krågeholm, nedströms Svedala AR","2016-06-15",17.3,6.8,70.924340082097189,7.63,12,60.5,7,15,130,1300,770,3600,"grumligt",2016,6]
[5,"2  Sege å, söder Krågeholm, nedströms Svedala AR","2016-08-16",16.100000000000001,9.6999999999999993,98.733639356705268,7.6,12,56.4,6.3,15,140,830,"<10",2300,"grumligt",2016,8]
[5,"2  Sege å, söder Krågeholm, nedströms Svedala AR","2016-10-17",10.1,8.1,72.172234726894587,7.66,11,52.4,4.5,10,110,1100,140,2700,"grumligt",2016,10]
[5,"2  Sege å, söder Krågeholm, nedströms Svedala AR","2016-12-15",3,12.5,92.891879929609928,7.68,19,56.9,4.5999999999999996,13,71,4100,140,5300,"grumligt",2016,12]
[5,"2  Sege å, söder Krågeholm, nedströms Svedala AR","2017-02-21",5.5,11.7,92.95614515739301,7.78,47,64,4.0999999999999996,11,110,6000,200,6800,"grumligt",2017,2]
[5,"2  Sege å, söder Krågeholm, nedströms Svedala AR","2017-04-18",7,12.3,101.56694510234605,7.87,19,53.4,7.6,13,59,3200,140,5000,"grumligt",2017,4]
[5,"2  Sege å, söder Krågeholm, nedströms Svedala AR","2017-06-21",18.7,6.4,68.615315147612904,7.79,22,53.7,7.5,16,140,840,230,2900,"grumligt",2017,6]
[5,"2  Sege å, söder Krågeholm, nedströms Svedala AR","2017-08-22",17.100000000000001,7.8,81.028490395768131,7.7,12,55.5,6.4,16,120,920,61,2400,null,2017,8]
[5,"2  Sege å, söder Krågeholm, nedströms Svedala AR","2017-10-17",12.8,9.8000000000000007,92.923843287963521,7.72,23,50.6,7,20,92,1400,14,3400,"grumligt",2017,10]
[5,"2  Sege å, söder Krågeholm, nedströms Svedala AR","2017-12-19",2.9,12.5,92.637852837442395,7.75,20,48.5,4.9000000000000004,18,74,2400,160,3800,"högflöde",2017,12]
[5,"2  Sege å, söder Krågeholm, nedströms Svedala AR","2018-02-19",2.7,12.8,94.341639068769254,7.81,17,51.6,5.2,16,65,2200,350,2900,null,2018,2]
[5,"2  Sege å, söder Krågeholm, nedströms Svedala AR","2018-04-16",10.199999999999999,11.3,100.92376284352569,7.8,22,51.7,7.4,15,66,1900,370,3300,"grumligt",2018,4]
[5,"2  Sege å, söder Krågeholm, nedströms Svedala AR","2018-06-20",18.399999999999999,8.1,86.337770354391878,7.73,14,64.2,6.2,14,160,1400,370,2900,"grumligt",2018,6]
[5,"2  Sege å, söder Krågeholm, nedströms Svedala AR","2018-08-17",17.5,6.9,72.255323299037855,7.59,6.2,65.400000000000006,6.8,14,120,1300,52,2600,null,2018,8]
[5,"2  Sege å, söder Krågeholm, nedströms Svedala AR","2018-10-16",12.9,6.6,62.721160271536981,7.7,3.7,73.3,5.6,13,180,2500,51,3400,null,2018,10]
[5,"2  Sege å, söder Krågeholm, nedströms Svedala AR","2018-12-11",6,9.8000000000000007,78.878506033786465,7.67,11,74.7,6.6,9.8000000000000007,60,10000,1900,12000,null,2018,12]
[5,"2  Sege å, söder Krågeholm, nedströms Svedala AR","2019-02-20",5,12,94,7.77,15,55,5.8,19,65,5800,78,7000,null,2019,2]
[5,"2  Sege å, söder Krågeholm, nedströms Svedala AR","2019-04-16",8.8000000000000007,12.1,104,8.01,14,55.1,7,17,30,2400,75,4100,null,2019,4]
[5,"2  Sege å, söder Krågeholm, nedströms Svedala AR","2019-06-18",17.2,6.3,66,7.58,8.1999999999999993,58,7.3,13,120,1300,280,2600,null,2019,6]
[5,"2  Sege å, söder Krågeholm, nedströms Svedala AR","2019-08-20",17.5,5.7,60,7.54,5.6,56.9,5.9,12,140,1400,43,2300,null,2019,8]
[5,"2  Sege å, söder Krågeholm, nedströms Svedala AR","2019-10-16",11.9,5.9,55,7.49,16,64.3,6.5,14,120,4400,1400,7300,null,2019,10]
[5,"2  Sege å, söder Krågeholm, nedströms Svedala AR","2019-12-11",5,10.4,82,7.61,40,71,7.6,16,140,3800,340,5200,null,2019,12]
[5,"2  Sege å, söder Krågeholm, nedströms Svedala AR","2020-02-12",4.5999999999999996,11.6,90,7.65,84,49.2,5.9,17,170,4400,200,6100,"grumligt",2020,2]
[5,"2  Sege å, söder Krågeholm, nedströms Svedala AR","2020-04-20",9.9,11,98,7.89,17,57.4,7.9,18,110,1700,59,3100,null,2020,4]
[5,"2  Sege å, söder Krågeholm, nedströms Svedala AR","2020-06-15",16.8,7.8,81,7.73,14,58.7,7.7,18,150,1200,100,2700,"grumligt",2020,6]
[5,"2  Sege å, söder Krågeholm, nedströms Svedala AR","2020-08-18",18.5,6,64,7.6,10,69.099999999999994,6.3,13,150,1600,80,3400,null,2020,8]
[5,"2  Sege å, söder Krågeholm, nedströms Svedala AR","2020-10-19",8.5,7.5,64,7.58,8.1,63.9,6,14,100,3500,380,4000,null,2020,10]
[5,"2  Sege å, söder Krågeholm, nedströms Svedala AR","2020-12-14",5.8,10.6,85,7.88,16,62.2,5.5,15,120,2300,450,3800,"grumligt",2020,12]
[7,"9  Sege å, vid Lilla Mölleberga","2011-02-22",0.7,14.1,98.263221397127253,7.81,12,59.6,null,14,81,2800,420,4300,"is i kanten",2011,2]
[7,"9  Sege å, vid Lilla Mölleberga","2011-04-11",10.3,10.8,96.686614633695996,8.16,7.8,61.6,null,15,110,1700,13,3200,"grumligt",2011,4]
[7,"9  Sege å, vid Lilla Mölleberga","2011-06-21",16.100000000000001,8.1,82.447678225702347,7.77,11,63.5,null,15,140,1000,26,2100,"lågflöde",2011,6]
[7,"9  Sege å, vid Lilla Mölleberga","2011-08-16",16.399999999999999,6.9,70.667677779197888,7.65,25,55.5,null,17,130,2000,19,3300,"högflöde, grumligt",2011,8]
[7,"9  Sege å, vid Lilla Mölleberga","2011-10-11",11.1,9.4,85.745296255616935,7.81,17,60,null,17,100,1600,29,2700,"grumligt",2011,10]
[7,"9  Sege å, vid Lilla Mölleberga","2011-12-19",3.2,12.1,90.411810620720587,7.9,24,60.8,null,11,74,3100,430,4200,"grumligt",2011,12]
[7,"9  Sege å, vid Lilla Mölleberga","2012-02-13",0.3,13.8,95.079031016883377,7.8,15,64.7,null,16,87,2600,470,4000,"istäckt ovanför bron",2012,2]
[7,"9  Sege å, vid Lilla Mölleberga","2012-04-16",7.9,11,92.907987535701992,7.99,6.5,66.099999999999994,null,14,58,1500,10,2500,"grumligt",2012,4]
[7,"9  Sege å, vid Lilla Mölleberga","2012-06-19",16.399999999999999,7.8,79.885200967788919,7.9,10,73.099999999999994,null,10,100,940,56,2000,"grumligt",{"$f":"YEAR(C135)","v":2012},{"$f":"MONTH(C135)","v":6}]
[7,"9  Sege å, vid Lilla Mölleberga","2012-08-20",19,6.8,73.325574730945675,7.84,7.5,79.7,null,9.6999999999999993,120,1100,43,1800,"något grumligt",2012,8]
[7,"9  Sege å, vid Lilla Mölleberga","2012-10-10",8.9,10.3,89.163852668856563,7.86,5.9,60.2,null,5.5,44,950,"<10",1300,"klart",2012,10]
[7,"9  Sege å, vid Lilla Mölleberga","2012-12-10",0.6,13.5,93.813914439637472,7.98,11,81.099999999999994,null,13,84,1800,230,2800,"is i kanten",2012,12]
[7,"9  Sege å, vid Lilla Mölleberga","2013-02-18",1.9,12.8,92.273562719280605,7.87,10,60.2,null,14,60,3000,180,4000,"grumligt",2013,2]
[7,"9  Sege å, vid Lilla Mölleberga","2013-04-15",9.6,15,132.06671890284591,8.3000000000000007,4.9000000000000004,61.5,null,12,48,1400,11,2400,null,2013,4]
[7,"9  Sege å, vid Lilla Mölleberga","2013-06-17",17.2,9.1,94.723398379418157,7.8,5.8,55.1,null,4,91,1100,17,2000,"grumligt",2013,6]
[7,"9  Sege å, vid Lilla Mölleberga","2013-08-20",17.100000000000001,8.5,88.300277995388356,7.7,3.3,54.6,null,7.3,87,530,24,1200,"klart vatten",2013,8]
[7,"9  Sege å, vid Lilla Mölleberga","2013-10-14",11.7,8.5,78.616137068003582,7.57,7.4,44.6,null,5.8,110,680,12,1400,null,2013,10]
[7,"9  Sege å, vid Lilla Mölleberga","2013-12-12",5.2,11.9,93.805547831037075,7.84,12,66.599999999999994,null,12,77,5400,80,6900,"grumligt",2013,12]
[7,"9  Sege å, vid Lilla Mölleberga","2014-02-18",3.4,12.4,93.15901273071168,7.9,15,55.3,null,11,78,3800,190,4400,"Högflöde",2014,2]
[7,"9  Sege å, vid Lilla Mölleberga","2014-04-14",8.9,10.5,90.895189613882906,7.97,12,58,null,14,74,1500,42,2600,"Måttligt flöde",2014,4]
[7,"9  Sege å, vid Lilla Mölleberga","2014-06-11",18.899999999999999,7.2,77.490078183843892,7.72,5.8,64.2,null,11,73,770,48,2000,"Grumligt",2014,6]
[7,"9  Sege å, vid Lilla Mölleberga","2014-08-18",15.1,7,69.777990502311027,7.59,5.5,58.7,null,8.6,120,550,37,1100,null,2014,8]
[7,"9  Sege å, vid Lilla Mölleberga","2014-10-20",13.3,8.1,77.662057748225706,7.55,107,43.7,null,14,200,4400,68,5200,"Högflöde, grumligt",2014,10]
[7,"9  Sege å, vid Lilla Mölleberga","2014-12-10",4.5999999999999996,11.4,88.451599605373943,7.9,33,62.2,null,13,100,3000,74,3900,"Grumligt",2014,12]
[7,"9  Sege å, vid Lilla Mölleberga","2015-02-10",3,12.8,95.12128504792058,7.89,18,56.7,null,12,67,2900,170,4300,"grumligt",2015,2]
[7,"9  Sege å, vid Lilla Mölleberga","2015-04-13",9.6,12.2,107.41426470764799,8.1,9.6,54.2,null,13,70,2200,61,3200,"grumligt",2015,4]
[7,"9  Sege å, vid Lilla Mölleberga","2015-06-15",16.7,10.199999999999999,105.10663955091921,8.02,5.0999999999999996,64.5,null,11,79,1100,28,2200,"grumligt",2015,6]
[7,"9  Sege å, vid Lilla Mölleberga","2015-08-18",16.600000000000001,6.5,66.843545988798169,7.92,4.2,62.8,null,9.9,100,660,33,1400,"grumligt",2015,8]
[7,"9  Sege å, vid Lilla Mölleberga","2015-10-19",8.5,10.9,93.439060616348357,7.98,5.5,62.8,null,8.3000000000000007,94,1100,84,1900,"grumligt",2015,10]
[7,"9  Sege å, vid Lilla Mölleberga","2015-12-09",6.9,10.199999999999999,84.012899139804261,8.01,15,58,null,13,100,3700,52,4600,"grumligt",2015,12]
[7,"9  Sege å, vid Lilla Mölleberga","2016-02-23",4.3,12,92.365998704861795,7.9,46,53.7,null,11,120,4200,120,4900,"grumligt",2016,2]
[7,"9  Sege å, vid Lilla Mölleberga","2016-04-19",8.6999999999999993,11.7,100.78992583928749,8.1199999999999992,7.5,64.7,null,11,65,1800,39,2800,null,2016,4]
[7,"9  Sege å, vid Lilla Mölleberga","2016-06-15",17.399999999999999,9.3000000000000007,97.193591871218672,7.95,11,69.400000000000006,null,9.6,94,830,37,1800,"ngt grumligt",2016,6]
[7,"9  Sege å, vid Lilla Mölleberga","2016-08-16",15.5,8.9,89.467741080892779,7.9,5.9,62.2,null,8.6999999999999993,98,840,30,1400,null,2016,8]
[7,"9  Sege å, vid Lilla Mölleberga","2016-10-17",8.6999999999999993,10.9,93.898306978481529,7.96,4.5,60.3,null,7.5,75,710,29,1900,"klart vatten",2016,10]
[7,"9  Sege å, vid Lilla Mölleberga","2016-12-15",2.9,12.8,94.861161305541017,7.89,15,64.400000000000006,null,11,69,4300,77,5200,"grumligt",2016,12]
[7,"9  Sege å, vid Lilla Mölleberga","2017-02-21",5.3,12,94.84226225331102,8.02,15,71.2,null,9.1,82,3100,120,3800,"grumligt",2017,2]
[7,"9  Sege å, vid Lilla Mölleberga","2017-04-18",7,12,99.089702538874178,8.01,16,59.7,null,11,73,3900,59,5100,"grumligt",2017,4]
[7,"9  Sege å, vid Lilla Mölleberga","2017-06-21",17.7,7.5,78.85105699827642,7.88,11,56.6,null,12,120,880,42,1800,"grumligt",2017,6]
[7,"9  Sege å, vid Lilla Mölleberga","2017-08-22",17.5,8.8000000000000007,92.151716671236684,7.98,7.3,55,null,11,110,680,21,1400,null,2017,8]
[7,"9  Sege å, vid Lilla Mölleberga","2017-10-17",12.9,10.199999999999999,96.932702237829886,7.95,14,59.2,null,14,120,1700,"<10",3000,"grumligt",2017,10]
[7,"9  Sege å, vid Lilla Mölleberga","2017-12-19",3.2,12.8,95.642245945886245,7.82,14,57.8,null,14,78,3400,150,4800,"högflöde",2017,12]
[7,"9  Sege å, vid Lilla Mölleberga","2018-02-19",2.2000000000000002,12.8,93.047173444892621,7.91,14,60.7,null,13,70,2900,210,3200,null,2018,2]
[7,"9  Sege å, vid Lilla Mölleberga","2018-04-16",10,11.3,100.44572828996098,7.94,12,58.5,null,13,78,2200,130,3300,null,2018,4]
[7,"9  Sege å, vid Lilla Mölleberga","2018-06-20",19,11.9,128.31975577915495,8.1199999999999992,3.8,71.3,null,11,92,780,15,1500,null,2018,6]
[7,"9  Sege å, vid Lilla Mölleberga","2018-08-17",18.899999999999999,7.1,76.413827097957167,7.72,1.7,57.4,null,8.8000000000000007,81,740,22,1200,null,2018,8]
[7,"9  Sege å, vid Lilla Mölleberga","2018-10-16",11.3,9,82.477865125545421,7.91,2.2000000000000002,66.400000000000006,null,7.4,60,800,25,1100,null,2018,10]
[7,"9  Sege å, vid Lilla Mölleberga","2018-12-11",4.8,11.8,92.041820727219431,7.87,10,76.5,null,8.4,58,6600,230,7000,"grumligt",2018,12]
[7,"9  Sege å, vid Lilla Mölleberga","2019-02-20",5.2,12.3,97,7.97,12,64.900000000000006,null,14,77,7000,56,8300,null,2019,2]
[7,"9  Sege å, vid Lilla Mölleberga","2019-04-16",7.4,12.2,102,8.08,10,63.7,null,13,41,2800,31,4200,null,2019,4]
[7,"9  Sege å, vid Lilla Mölleberga","2019-06-18",17.8,6.6,70,7.68,8.9,50.5,null,9.4,86,1700,39,2500,null,2019,6]
[7,"9  Sege å, vid Lilla Mölleberga","2019-08-20",17.3,7.7,80,7.78,3.4,55.4,null,8.3000000000000007,96,570,36,1200,null,2019,8]
[7,"9  Sege å, vid Lilla Mölleberga","2019-10-16",12.1,8,75,7.75,6.5,68.400000000000006,null,11,70,4700,180,5600,null,2019,10]
[7,"9  Sege å, vid Lilla Mölleberga","2019-12-11",4.5999999999999996,11.4,88,7.97,27,67.2,null,13,110,6000,89,6400,null,2019,12]
[7,"9  Sege å, vid Lilla Mölleberga","2020-02-12",4.4000000000000004,12.1,93,7.91,49,57.8,null,59,130,4800,110,5800,"grumligt",2020,2]
[7,"9  Sege å, vid Lilla Mölleberga","2020-04-20",9.1,12.1,105,8,8.9,68.099999999999994,null,12,110,2200,28,2800,null,2020,4]
[7,"9  Sege å, vid Lilla Mölleberga","2020-06-15",18.3,7.3,78,7.99,5.8,62.6,null,12,110,1000,50,1800,null,2020,6]
[7,"9  Sege å, vid Lilla Mölleberga","2020-08-18",18.3,6.5,69,7.56,2,71.400000000000006,null,8.6,120,410,87,1300,null,2020,8]
[7,"9  Sege å, vid Lilla Mölleberga","2020-10-19",7.1,10.7,89,7.94,3.8,66.900000000000006,null,8.4,67,1600,28,2300,null,2020,10]
[7,"9  Sege å, vid Lilla Mölleberga","2020-12-14",4.5999999999999996,11.1,86,8.0500000000000007,7.2,75.7,null,9.5,83,2100,58,3100,null,2020,12]
[9,"18 Sege å, nordväst Valdemarsro, järnvägsbron","2011-02-22",0.4,13.3,91.897144184569001,7.79,12,68.3,null,11,88,3300,300,4700,"is i kanten",2011,2]
[9,"18 Sege å, nordväst Valdemarsro, järnvägsbron","2011-04-11",11.3,12.3,112.71974900491209,8.1999999999999993,8,68.7,null,14,89,2000,"<10",3200,"grumligt",2011,4]
[9,"18 Sege å, nordväst Valdemarsro, järnvägsbron","2011-06-21",16.100000000000001,7.5,76.340442801576245,7.8,6,69.900000000000006,null,11,130,970,29,1900,"lågflöde",2011,6]
[9,"18 Sege å, nordväst Valdemarsro, järnvägsbron","2011-08-16",16.8,6.6,68.148381119707366,7.71,9.1,64.099999999999994,null,15,120,1800,38,3100,"högflöde, grumligt",2011,8]
[9,"18 Sege å, nordväst Valdemarsro, järnvägsbron","2011-10-11",11.2,9,82.287205169871839,7.74,10,65.900000000000006,null,17,88,1200,"<10",2400,"grumligt",2011,10]
[9,"18 Sege å, nordväst Valdemarsro, järnvägsbron","2011-12-19",3.7,12,90.889404594720219,7.8,27,67.599999999999994,null,11,100,4200,130,5200,"grumligt",2011,12]
[9,"18 Sege å, nordväst Valdemarsro, järnvägsbron","2012-02-13",1,13.3,93.48157900425052,7.8,15,94.9,null,12,91,2900,330,4100,"svag oljehinna och lukt",2012,2]
[9,"18 Sege å, nordväst Valdemarsro, järnvägsbron","2012-04-16",8.1999999999999993,10.9,92.750813571392797,8.0299999999999994,5.5,70.5,null,12,56,1600,20,3000,"grumligt",2012,4]
[9,"18 Sege å, nordväst Valdemarsro, järnvägsbron","2012-06-19",16.5,6.8,69.786104083946128,7.8,3.9,68.400000000000006,null,10,98,1000,61,1900,"grumligt",2012,6]
[9,"18 Sege å, nordväst Valdemarsro, järnvägsbron","2012-08-20",19.2,6.3,68.194044315417429,7.84,3.6,78.3,null,8.1,160,1000,87,1600,"klart vatten",2012,8]
[9,"18 Sege å, nordväst Valdemarsro, järnvägsbron","2012-10-10",10.199999999999999,10.3,91.992456397195994,7.65,22,28.6,null,7.6,96,480,72,1100,"grumligt",2012,10]
[9,"18 Sege å, nordväst Valdemarsro, järnvägsbron","2012-12-10",0.5,12.7,88.002843617073736,7.94,8.1,101,null,12,98,2100,190,3200,"is i kanten",2012,12]
[9,"18 Sege å, nordväst Valdemarsro, järnvägsbron","2013-02-18",2.2999999999999998,12.6,91.847661872413383,7.83,17,110.9,null,13,78,3500,150,4600,"grumligt",{"$f":"YEAR(C199)","v":2013},{"$f":"MONTH(C199)","v":2}]
[9,"18 Sege å, nordväst Valdemarsro, järnvägsbron","2013-04-15",10.9,16.5,149.81142621186908,8.4,4.8,69.099999999999994,null,11,44,1400,13,2400,null,2013,4]
[9,"18 Sege å, nordväst Valdemarsro, järnvägsbron","2013-06-17",17.600000000000001,9.6999999999999993,101.77857104724998,7.8,4.5,61.2,null,9.1999999999999993,110,830,11,1700,"grumligt",2013,6]
[9,"18 Sege å, nordväst Valdemarsro, järnvägsbron","2013-08-20",17.399999999999999,6.6,68.976097456993884,7.6,2.2000000000000002,57.8,null,7.2,110,550,43,1200,"ovanligt klart vatten",2013,8]
[9,"18 Sege å, nordväst Valdemarsro, järnvägsbron","2013-10-14",11.9,9,83.622029792153043,7.72,9.9,53.4,null,6.3,100,720,45,1400,null,2013,10]
[9,"18 Sege å, nordväst Valdemarsro, järnvägsbron","2013-12-12",5.7,11.6,92.643083103285335,7.84,11,74.900000000000006,null,11,76,6600,66,8100,"grumligt",2013,12]
[9,"18 Sege å, nordväst Valdemarsro, järnvägsbron","2014-02-18",3.7,12.2,92.404228004632216,7.9,11,66.3,null,9.9,69,5100,110,5600,"Högflöde",2014,2]
[9,"18 Sege å, nordväst Valdemarsro, järnvägsbron","2014-04-14",8.9,10.6,91.76085808639607,7.88,11,56.9,null,9.1,74,1500,140,2600,"Måttligt flöde",2014,4]
[9,"18 Sege å, nordväst Valdemarsro, järnvägsbron","2014-06-11",19,7.5,80.873795659131261,7.79,4.4000000000000004,76.7,null,9.6,97,1400,69,2700,"Grumligt",2014,6]
[9,"18 Sege å, nordväst Valdemarsro, järnvägsbron","2014-08-18",15.4,7.2,72.226789260406747,7.6,4.2,51.9,null,7,120,710,150,1200,"Grumligt",2014,8]
[9,"18 Sege å, nordväst Valdemarsro, järnvägsbron","2014-10-20",13.1,7.7,73.500829249414366,7.56,85,49.9,null,13,200,4300,39,4900,"Högflöde, grumligt",2014,10]
[9,"18 Sege å, nordväst Valdemarsro, järnvägsbron","2014-12-10",6,11.6,93.366394897134981,7.88,54,55.1,null,11,130,3600,100,3400,"Grumligt",2014,12]
[9,"18 Sege å, nordväst Valdemarsro, järnvägsbron","2015-02-10",3.2,12.7,94.895040899434008,7.89,16,67.5,null,12,78,3600,120,4900,"grumligt",2015,2]
[9,"18 Sege å, nordväst Valdemarsro, järnvägsbron","2015-04-13",9.4,11.8,103.39396915796218,8.0399999999999991,6.7,58.9,null,10,69,2600,78,3400,"grumligt",2015,4]
[9,"18 Sege å, nordväst Valdemarsro, järnvägsbron","2015-06-15",16.8,10.5,108.41787905407992,8.09,3.3,72.099999999999994,null,10,83,1199,39,2000,"grumligt",2015,6]
[9,"18 Sege å, nordväst Valdemarsro, järnvägsbron","2015-08-18",17.899999999999999,6,63.330679260626269,7.73,12,70,null,9.3000000000000007,140,590,67,1200,"lågflöde",2015,8]
[9,"18 Sege å, nordväst Valdemarsro, järnvägsbron","2015-10-19",9,9.8000000000000007,85.042199237289722,7.93,8.5,70.2,null,7.3,170,1100,52,1800,"grumligt",2015,10]
[9,"18 Sege å, nordväst Valdemarsro, järnvägsbron","2015-12-09",6.9,10.9,89.778490257241813,7.96,13,62.3,null,12,97,4400,83,5200,"grumligt",2015,12]
[9,"18 Sege å, nordväst Valdemarsro, järnvägsbron","2016-02-23",4.5,12,92.859774027446193,7.89,38,63.9,null,10,110,4800,78,5300,"grumligt",2016,2]
[9,"18 Sege å, nordväst Valdemarsro, järnvägsbron","2016-04-19",8.3000000000000007,11,93.833171976761818,8.1300000000000008,5.7,69.7,null,9.6999999999999993,68,2000,16,2900,null,2016,4]
[9,"18 Sege å, nordväst Valdemarsro, järnvägsbron","2016-06-15",17.100000000000001,9.3000000000000007,96.61089239495432,7.9,6.4,73.8,null,11,120,860,110,1800,"ngt grumligt",2016,6]
[9,"18 Sege å, nordväst Valdemarsro, järnvägsbron","2016-08-16",15.5,7,70.367886243398814,7.78,2.4,66.2,null,8.1,98,670,37,1200,null,2016,8]
[9,"18 Sege å, nordväst Valdemarsro, järnvägsbron","2016-10-17",9,9.3000000000000007,80.703311521101455,7.9,4.0999999999999996,64.2,null,6.9,94,910,52,1700,"klart vatten",2016,10]
[9,"18 Sege å, nordväst Valdemarsro, järnvägsbron","2016-12-15",3,12.5,92.891879929609928,7.9,15,70.8,null,10,79,5300,64,6000,null,2016,12]
[9,"18 Sege å, nordväst Valdemarsro, järnvägsbron","2017-02-21",5.4,11.8,93.506017407163711,8.0299999999999994,11,80.2,null,8.4,68,3700,100,4400,"grumligt",2017,2]
[9,"18 Sege å, nordväst Valdemarsro, järnvägsbron","2017-04-18",7,12.2,100.74119758118876,8.0399999999999991,12,65.5,null,9.9,78,4300,31,5500,"grumligt",2017,4]
[9,"18 Sege å, nordväst Valdemarsro, järnvägsbron","2017-06-21",18.7,6.8,72.903772344338719,7.85,4.2,62.5,null,10,99,1100,44,1900,"grumligt",2017,6]
[9,"18 Sege å, nordväst Valdemarsro, järnvägsbron","2017-08-22",17.100000000000001,7.3,75.834356396039411,7.75,4.7,56.7,null,8.1999999999999993,120,570,27,1300,null,2017,8]
[9,"18 Sege å, nordväst Valdemarsro, järnvägsbron","2017-10-17",13,9,85.719467818508335,7.9,9.1,67.3,null,14,120,2100,18,3100,null,2017,10]
[9,"18 Sege å, nordväst Valdemarsro, järnvägsbron","2017-12-19",3.3,12.6,94.40459274065303,7.81,13,65.8,null,13,82,4900,100,5500,"högflöde",2017,12]
[9,"18 Sege å, nordväst Valdemarsro, järnvägsbron","2018-02-19",2.5,12.6,92.357113569572107,7.89,21,69.3,null,12,92,3800,170,3700,null,2018,2]
[9,"18 Sege å, nordväst Valdemarsro, järnvägsbron","2018-04-16",9.6999999999999993,11.5,101.49416267224531,7.93,12,66.7,null,12,84,2700,78,3700,null,2018,4]
[9,"18 Sege å, nordväst Valdemarsro, järnvägsbron","2018-06-20",18.5,7.2,76.893967340315456,7.85,2.2000000000000002,75.099999999999994,null,9.6999999999999993,86,400,39,1100,null,2018,6]
[9,"18 Sege å, nordväst Valdemarsro, järnvägsbron","2018-08-17",19.5,5.0999999999999996,55.51989509310561,7.6,3.3,66.7,null,13,130,480,"<10",1100,null,2018,8]
[9,"18 Sege å, nordväst Valdemarsro, järnvägsbron","2018-10-16",11.3,5.2,47.653877628092914,7.88,2.2999999999999998,72.099999999999994,null,6.4,82,610,54,990,"nyrensat",2018,10]
[9,"18 Sege å, nordväst Valdemarsro, järnvägsbron","2018-12-11",5.0999999999999996,11.2,88.055865367010981,7.88,9.9,76.900000000000006,null,8.6,63,6000,120,6500,null,2018,12]
[9,"18 Sege å, nordväst Valdemarsro, järnvägsbron","2019-02-20",5.4,12,95,7.95,9.3000000000000007,74.400000000000006,null,12,61,9600,56,10000,null,2019,2]
[9,"18 Sege å, nordväst Valdemarsro, järnvägsbron","2019-04-16",6.5,12.9,105,8.1,9.8000000000000007,71.5,null,12,48,4200,23,4100,null,2019,4]
[9,"18 Sege å, nordväst Valdemarsro, järnvägsbron","2019-06-18",18.7,6.6,71,7.78,3.8,57.4,null,9.6,100,2000,56,2600,null,2019,6]
[9,"18 Sege å, nordväst Valdemarsro, järnvägsbron","2019-08-20",17.899999999999999,6.3,66,7.64,2.2999999999999998,56.3,null,6.7,120,270,62,790,null,2019,8]
[9,"18 Sege å, nordväst Valdemarsro, järnvägsbron","2019-10-16",12.2,7,65,7.73,5.6,66,null,9.4,85,3600,47,4500,null,2019,10]
[9,"18 Sege å, nordväst Valdemarsro, järnvägsbron","2019-12-11",6.2,11.2,91,7.9550000000000001,44.5,55.6,null,8.1999999999999993,150,4200,74,5000,null,2019,12]
[9,"18 Sege å, nordväst Valdemarsro, järnvägsbron","2020-02-12",4.7,11.9,93,7.88,49,63.5,null,12,140,7300,82,6900,"grumligt",2020,2]
[9,"18 Sege å, nordväst Valdemarsro, järnvägsbron","2020-04-20",9.5,10.3,90,8.08,6.8,74.2,null,11,88,2500,17,3400,null,2020,4]
[9,"18 Sege å, nordväst Valdemarsro, järnvägsbron","2020-06-15",18.399999999999999,8.4,90,7.98,4.8,70,null,9.6999999999999993,100,840,72,1400,null,2020,6]
[9,"18 Sege å, nordväst Valdemarsro, järnvägsbron","2020-08-18",18.2,4.4000000000000004,47,7.74,3.9,63.8,null,11,120,550,33,1500,null,2020,8]
[9,"18 Sege å, nordväst Valdemarsro, järnvägsbron","2020-10-19",7.6,9.5,80,7.9,5,70.599999999999994,null,7.4,68,1300,35,1800,null,2020,10]
[9,"18 Sege å, nordväst Valdemarsro, järnvägsbron","2020-12-14",4.9000000000000004,10.7,84,8.07,6.4,79.599999999999994,null,9.1,87,2300,62,3100,null,2020,12]
[11,"21 Spångholmsbäcken, vid utlopp till Sege å","2011-02-22",1,12.7,89.264364913833177,7.76,10,59.3,null,16,59,1400,470,2700,"is i kanten",2011,2]
[11,"21 Spångholmsbäcken, vid utlopp till Sege å","2011-04-11",10.7,11,99.408430431500349,7.99,7,56,null,14,77,1000,140,2100,"något grumligt",2011,4]
[11,"21 Spångholmsbäcken, vid utlopp till Sege å","2011-06-21",15.1,7.4,73.765304245300229,7.76,6.9,69.7,null,7.8,110,1000,54,1500,"lågflöde",2011,6]
[11,"21 Spångholmsbäcken, vid utlopp till Sege å","2011-08-16",16.7,6.1,62.857892280451686,7.54,7.5,51.1,null,18,75,930,"<10",2000,"högflöde",2011,8]
[11,"21 Spångholmsbäcken, vid utlopp till Sege å","2011-10-11",11.1,7.8,71.150352212107663,7.61,5.0999999999999996,59.7,null,17,58,1000,13,1700,"grumligt",2011,10]
[11,"21 Spångholmsbäcken, vid utlopp till Sege å","2011-12-19",3,11.9,88.433069692988667,7.8,10,57.4,null,16,49,1300,130,2700,"grumligt",2011,12]
[11,"21 Spångholmsbäcken, vid utlopp till Sege å","2012-02-13",0.4,13.4,92.588100155881548,7.7,15,69.5,null,17,77,1500,280,2700,"delvis istäckt",2012,2]
[11,"21 Spångholmsbäcken, vid utlopp till Sege å","2012-04-16",6.8,10.4,85.442793230466933,7.87,5,57.8,null,16,59,940,47,1800,"grumligt",2012,4]
[11,"21 Spångholmsbäcken, vid utlopp till Sege å","2012-06-19",16.2,7.3,74.457984405854347,7.8,7.9,66.400000000000006,null,7.8,99,790,190,1600,"klart vatten",2012,6]
[11,"21 Spångholmsbäcken, vid utlopp till Sege å","2012-08-20",16.8,7.4,76.408790952399173,7.88,3.7,71.7,null,6.1,210,850,100,1500,"klart vatten",2012,8]
[11,"21 Spångholmsbäcken, vid utlopp till Sege å","2012-10-10",8.6,5.7,48.982685318970724,7.46,5.9,61.8,null,11,71,210,"<10",1200,"klart, lågflöde",2012,10]
[11,"21 Spångholmsbäcken, vid utlopp till Sege å","2012-12-10",0.4,12.6,87.060452385381154,7.87,7.3,59.4,null,13,66,660,140,1800,"delvis istäckt",2012,12]
[11,"21 Spångholmsbäcken, vid utlopp till Sege å","2013-02-18",1.8,12.9,92.735094357627318,7.81,9.1,67.3,null,16,44,1300,260,2400,null,2013,2]
[11,"21 Spångholmsbäcken, vid utlopp till Sege å","2013-04-15",10.8,16,144.93286294440634,8.4,10,56.5,null,15,55,810,19,1800,"grumligt",2013,4]
[11,"21 Spångholmsbäcken, vid utlopp till Sege å","2013-06-17",22.7,7.9,91.130675384425871,7.8,8.5,64.8,null,7.8,97,510,160,1300,"grumligt",2013,6]
[11,"21 Spångholmsbäcken, vid utlopp till Sege å","2013-08-20",16.899999999999999,10.3,106.56834856136048,8,2.8,71.7,null,6,92,500,61,1000,"klart vatten",2013,8]
[11,"21 Spångholmsbäcken, vid utlopp till Sege å","2013-10-14",11.5,7.8,71.811325926238752,7.66,4.0999999999999996,46.7,null,5.8,110,560,"<10",1200,null,{"$f":"YEAR(C263)","v":2013},{"$f":"MONTH(C263)","v":10}]
[11,"21 Spångholmsbäcken, vid utlopp till Sege å","2013-12-12",4.4000000000000004,11.7,90.297470735073119,7.8,10,58.3,null,14,71,1700,160,3200,null,2013,12]
[11,"21 Spångholmsbäcken, vid utlopp till Sege å","2014-02-18",3.7,12.3,93.161639709588229,7.87,10,51.8,null,14,56,1700,250,2400,"Högflöde",2014,2]
[11,"21 Spångholmsbäcken, vid utlopp till Sege å","2014-04-14",8.6,11,94.527989212048752,7.94,8.6,52,null,14,59,620,15,1900,"Måttligt flöde, grumligt",2014,4]
[11,"21 Spångholmsbäcken, vid utlopp till Sege å","2014-06-11",16.2,6.4,65.278232903762728,7.62,7.7,70.7,null,7.4,110,580,210,1600,"Grumligt",2014,6]
[11,"21 Spångholmsbäcken, vid utlopp till Sege å","2014-08-18",14.1,4.7,45.858641117177982,7.54,3.6,59.8,null,6.9,85,520,41,880,"Klart vatten",2014,8]
[11,"21 Spångholmsbäcken, vid utlopp till Sege å","2014-10-20",13,7.4,70.480451317440185,7.49,43,52.2,null,14,120,3700,53,4500,"Högflöde, grumligt",2014,10]
[11,"21 Spångholmsbäcken, vid utlopp till Sege å","2014-12-10",4.5,11.2,86.669122425616436,7.75,38,53.1,null,12,90,1600,170,2500,"Grumligt",2014,12]
[11,"21 Spångholmsbäcken, vid utlopp till Sege å","2015-02-10",2.2999999999999998,12.7,92.57661156981348,7.84,12,52.3,null,16,47,1300,310,3100,"klart",2015,2]
[11,"21 Spångholmsbäcken, vid utlopp till Sege å","2015-04-13",9.9,11.8,104.64071105238489,7.99,8.6999999999999993,53.4,null,17,66,1100,16,2400,null,2015,4]
[11,"21 Spångholmsbäcken, vid utlopp till Sege å","2015-06-15",13.9,9.1,88.405309064272799,7.87,15,71.8,null,8.9,93,1400,66,2200,"något grumligt",2015,6]
[11,"21 Spångholmsbäcken, vid utlopp till Sege å","2015-08-18",15.9,7.6,77.038939529537672,7.8,5.6,92.5,null,5.9,99,1100,89,1600,"lågflöde",2015,8]
[11,"21 Spångholmsbäcken, vid utlopp till Sege å","2015-10-19",7.8,9.9,83.409235409395549,7.85,2.4,68.2,null,6.4,87,1100,33,1600,"klart vatten",2015,10]
[11,"21 Spångholmsbäcken, vid utlopp till Sege å","2015-12-09",6.3,11.1,90.035393043513608,7.92,9.6,50.9,null,14,64,1500,140,3200,null,2015,12]
[11,"21 Spångholmsbäcken, vid utlopp till Sege å","2016-02-23",4.0999999999999996,12,91.872999659862202,7.84,8,52.4,null,12,46,2000,320,3100,"grumligt",2016,2]
[11,"21 Spångholmsbäcken, vid utlopp till Sege å","2016-04-19",9.3000000000000007,12,104.89302594525915,8.0500000000000007,6.4,59.5,null,12,67,1300,78,2300,null,2016,4]
[11,"21 Spångholmsbäcken, vid utlopp till Sege å","2016-06-15",16.100000000000001,8.1,82.447678225702347,7.83,8.1,110,null,6.2,91,1800,240,2100,"ngt grumligt",2016,6]
[11,"21 Spångholmsbäcken, vid utlopp till Sege å","2016-08-16",13.4,8,76.87261698009786,7.86,9.6,70.2,null,6.5,140,1800,61,1800,"stillastående",2016,8]
[11,"21 Spångholmsbäcken, vid utlopp till Sege å","2016-10-17",9.3000000000000007,9.3000000000000007,81.292095107575847,7.78,4.7,57.7,null,6.2,89,820,35,1300,"klart vatten",2016,10]
[11,"21 Spångholmsbäcken, vid utlopp till Sege å","2016-12-15",2.4,12.2,89.178381990093911,7.81,12,56.2,null,13,67,1300,200,2700,null,2016,12]
[11,"21 Spångholmsbäcken, vid utlopp till Sege å","2017-02-21",5,12,94.097485517328309,7.91,5.7,69.7,null,11,46,1200,180,2200,"klart",2017,2]
[11,"21 Spångholmsbäcken, vid utlopp till Sege å","2017-04-18",7,12,99.089702538874178,7.97,11,55.9,null,12,68,1400,23,2300,null,2017,4]
[11,"21 Spångholmsbäcken, vid utlopp till Sege å","2017-06-21",15,7.7,76.593432114018185,7.83,12,62.4,null,12,120,1100,72,2000,"klart vatten",2017,6]
[11,"21 Spångholmsbäcken, vid utlopp till Sege å","2017-08-22",17.5,9.1,95.293252466847008,7.91,6,71.099999999999994,null,6.8,120,730,77,1200,null,2017,8]
[11,"21 Spångholmsbäcken, vid utlopp till Sege å","2017-10-17",12.9,8.4,79.826931254683444,7.77,5.9,55.7,null,16,93,540,30,1800,null,2017,10]
[11,"21 Spångholmsbäcken, vid utlopp till Sege å","2017-12-19",3.4,12,90.15388328778549,7.8,11,55.3,null,15,55,1400,240,2700,"högflöde",2017,12]
[11,"21 Spångholmsbäcken, vid utlopp till Sege å","2018-02-19",2,12.9,93.254071666477543,7.85,16,58.8,null,15,65,1500,370,2300,null,2018,2]
[11,"21 Spångholmsbäcken, vid utlopp till Sege å","2018-04-16",10.7,10.7,96.697291419732153,7.95,9.6,57.6,null,21,66,1200,220,2300,null,2018,4]
[11,"21 Spångholmsbäcken, vid utlopp till Sege å","2018-06-20",17.8,6.9,72.686670054927262,7.82,3.3,75.2,null,7.8,110,4000,61,4400,null,2018,6]
[11,"21 Spångholmsbäcken, vid utlopp till Sege å","2018-08-17",17.399999999999999,6.2,64.795727914145772,7.68,3.8,75.3,null,5.7,140,610,41,950,"stillastående",2018,8]
[11,"21 Spångholmsbäcken, vid utlopp till Sege å","2018-10-16",10.7,8.1999999999999993,74.104466321663892,7.83,2.7,81.400000000000006,null,4.9000000000000004,85,660,25,1000,"nästan stillastående",2018,10]
[11,"21 Spångholmsbäcken, vid utlopp till Sege å","2018-12-11",5.0999999999999996,11.2,88.055865367010981,7.86,4.5,108,null,9.3000000000000007,39,3500,62,4100,null,2018,12]
[11,"21 Spångholmsbäcken, vid utlopp till Sege å","2019-02-20",5.3,12,95,7.89,7.9,62.2,null,18,65,3000,370,4500,null,2019,2]
[11,"21 Spångholmsbäcken, vid utlopp till Sege å","2019-04-16",6.8,12.1,99,7.93,8.1999999999999993,68.5,null,15,110,2400,65,3700,null,2019,4]
[11,"21 Spångholmsbäcken, vid utlopp till Sege å","2019-06-18",15.8,5.5,56,7.59,3.3,73.599999999999994,null,13,81,2300,82,2900,null,2019,6]
[11,"21 Spångholmsbäcken, vid utlopp till Sege å","2019-08-20",17.100000000000001,4.7,49,7.63,3,62.4,null,5.6,150,450,41,790,null,2019,8]
[11,"21 Spångholmsbäcken, vid utlopp till Sege å","2019-10-16",11.8,7,65,7.62,2.5,85.7,null,12,55,3200,49,4400,null,2019,10]
[11,"21 Spångholmsbäcken, vid utlopp till Sege å","2019-12-11",4.8,10.7,83,7.82,14,62.8,null,14,83,2900,170,3600,null,2019,12]
[11,"21 Spångholmsbäcken, vid utlopp till Sege å","2020-02-12",4.4000000000000004,11.7,90,7.82,12,60,null,16,73,3100,380,4300,null,2020,2]
[11,"21 Spångholmsbäcken, vid utlopp till Sege å","2020-04-20",9.5,10.7,94,7.92,10,77.8,null,10,110,3100,97,3900,null,2020,4]
[11,"21 Spångholmsbäcken, vid utlopp till Sege å","2020-06-15",15.3,7.9,79,7.88,9.1,76.599999999999994,null,7.6,120,1200,62,1600,null,2020,6]
[11,"21 Spångholmsbäcken, vid utlopp till Sege å","2020-08-18",16,6.1,62,7.81,6.1,80.599999999999994,null,5.4,190,690,66,1200,null,2020,8]
[11,"21 Spångholmsbäcken, vid utlopp till Sege å","2020-10-19",6.2,9.6,78,7.85,3.4,81.3,null,6,94,1300,54,1800,null,2020,10]
[11,"21 Spångholmsbäcken, vid utlopp till Sege å","2020-12-14",5.2,10.4,82,7.98,7.7,86.2,null,9.1999999999999993,72,1600,68,2300,null,2020,12]
[13,"22b Spångholmsbäcken, bron vid Torupsvägen","2011-02-22",1.2,12.6,89.064103379511948,7.68,7,53.3,null,18,47,1200,530,2700,"is i kanten",2011,2]
[13,"22b Spångholmsbäcken, bron vid Torupsvägen","2011-04-11",10.8,10.9,98.735512880876826,7.97,8.1,51.8,null,17,55,920,280,2300,null,2011,4]
[13,"22b Spångholmsbäcken, bron vid Torupsvägen","2011-06-21",14.8,7.8,77.259066363759445,7.87,5.2,66.7,null,10,53,2700,28,3800,"lågflöde",2011,6]
[13,"22b Spångholmsbäcken, bron vid Torupsvägen","2011-08-16",17.100000000000001,7.7,79.989663595822392,7.56,10,47.6,null,22,85,720,"<10",2200,"högflöde, grumligt",2011,8]
[13,"22b Spångholmsbäcken, bron vid Torupsvägen","2011-10-11",11.1,9.1999999999999993,83.920928250178264,7.64,7,55.5,null,22,79,940,170,2100,"grumligt",2011,10]
[13,"22b Spångholmsbäcken, bron vid Torupsvägen","2011-12-19",2.8,12.2,90.166843595690324,7.7,9.9,53.6,null,16,52,1000,150,2600,"grumligt",2011,12]
[13,"22b Spångholmsbäcken, bron vid Torupsvägen","2012-02-13",0.2,14,96.180467021504498,7.9,10,59.1,null,18,53,980,300,2400,"is i kanten",2012,2]
[13,"22b Spångholmsbäcken, bron vid Torupsvägen","2012-04-16",7.1,10.8,89.406745960842244,7.9,7.5,53.8,null,19,46,900,120,2400,"grumligt",2012,4]
[13,"22b Spångholmsbäcken, bron vid Torupsvägen","2012-06-19",14.3,6.4,62.71633589768215,7.8,3.6,66.599999999999994,null,9.5,40,2500,45,3400,"klart vatten",2012,6]
[13,"22b Spångholmsbäcken, bron vid Torupsvägen","2012-08-20",17.2,6,62.454987942473508,7.78,3.3,73.5,null,6.5,46,2300,23,2700,"klart vatten",2012,8]
[13,"22b Spångholmsbäcken, bron vid Torupsvägen","2012-10-10",8.6,8.5,73.044355300219493,7.77,5.2,73.8,null,7.9,71,1600,"<10",2300,"klart, lågflöde",2012,10]
[13,"22b Spångholmsbäcken, bron vid Torupsvägen","2012-12-10",0.6,13.5,93.813914439637472,7.84,8.4,52,null,17,61,480,140,1900,"isfritt",2012,12]
[13,"22b Spångholmsbäcken, bron vid Torupsvägen","2013-02-18",1.5,13.1,93.384362839424682,7.81,6.9,49.4,null,19,36,470,360,2400,null,2013,2]
[13,"22b Spångholmsbäcken, bron vid Torupsvägen","2013-04-15",9.9,11.8,104.64071105238489,8,6.2,52.3,null,15,38,790,280,2200,null,2013,4]
[13,"22b Spångholmsbäcken, bron vid Torupsvägen","2013-06-17",16.3,9.6,98.118843552231979,7.8,4.5999999999999996,60.9,null,11,69,1200,47,1800,"grumligt",2013,6]
[13,"22b Spångholmsbäcken, bron vid Torupsvägen","2013-08-20",14.4,6.6,64.815661718868029,7.7,2.4,66.7,null,8.4,73,1300,31,1900,"klart vatten",2013,8]
[13,"22b Spångholmsbäcken, bron vid Torupsvägen","2013-10-14",11.6,5.7,52.598279759482239,7.6,5.7,67.7,null,11,170,1700,420,3300,null,2013,10]
[13,"22b Spångholmsbäcken, bron vid Torupsvägen","2013-12-12",4.3,12.1,93.135715360735645,7.72,13,50.8,null,18,93,1700,270,3600,null,2013,12]
[13,"22b Spångholmsbäcken, bron vid Torupsvägen","2014-02-18",3.4,12.5,93.910295091443217,7.9,8,47.9,null,15,50,1300,290,2600,"Högflöde",2014,2]
[13,"22b Spångholmsbäcken, bron vid Torupsvägen","2014-04-14",8.8000000000000007,10.8,93.264487572896087,7.87,12,51.1,null,19,70,460,"<10",2300,"Måttligt flöde, grumligt",2014,4]
[13,"22b Spångholmsbäcken, bron vid Torupsvägen","2014-06-11",16.100000000000001,5.4,54.965118817134908,7.62,5.7,66.2,null,9.8000000000000007,66,1600,95,3000,"Lågt flöde",{"$f":"YEAR(C327)","v":2014},{"$f":"MONTH(C327)","v":6}]
[13,"22b Spångholmsbäcken, bron vid Torupsvägen","2014-08-18",14.1,7.5,73.178682633794651,7.64,6.5,48.1,null,7.6,89,1400,50,2000,"Klart vatten",2014,8]
[13,"22b Spångholmsbäcken, bron vid Torupsvägen","2014-10-20",12.8,7.2,68.270578742177264,7.33,17,50.4,null,20,120,4000,130,5100,"Högflöde, klart",2014,10]
[13,"22b Spångholmsbäcken, bron vid Torupsvägen","2014-12-10",4,11.4,87.045457199796019,7.71,15,53,null,19,26,1300,250,2500,"Grumligt",2014,12]
[13,"22b Spångholmsbäcken, bron vid Torupsvägen","2015-02-10",2.6,12.9,94.817262821359435,7.8,11,47.9,null,17,43,1100,350,2900,"klart, ingen lukt",2015,2]
[13,"22b Spångholmsbäcken, bron vid Torupsvägen","2015-04-13",10.3,11.6,103.84858608804383,7.98,30,49.7,null,19,82,760,14,2200,"grumligt",2015,4]
[13,"22b Spångholmsbäcken, bron vid Torupsvägen","2015-06-15",12.1,7.1,66.269387241202423,7.73,4.3,66.599999999999994,null,11,67,2600,54,3600,"klart vatten",2015,6]
[13,"22b Spångholmsbäcken, bron vid Torupsvägen","2015-08-18",15.8,5.3,53.613093621255935,7.7,8.1999999999999993,69.8,null,6.5,52,1700,47,2200,"lågflöde",2015,8]
[13,"22b Spångholmsbäcken, bron vid Torupsvägen","2015-10-19",7.6,8.6999999999999993,72.933768936361361,7.81,4,69.5,null,9.8000000000000007,68,1500,17,2200,"klart vatten",2015,10]
[13,"22b Spångholmsbäcken, bron vid Torupsvägen","2015-12-09",6.2,11.1,89.804117676612947,7.94,11,46.6,null,17,72,1100,150,3000,null,2015,12]
[13,"22b Spångholmsbäcken, bron vid Torupsvägen","2016-02-23",4,12,91.626797052416862,7.8,11,47.9,null,16,45,1500,500,2900,"grumligt",2016,2]
[13,"22b Spångholmsbäcken, bron vid Torupsvägen","2016-04-19",8.3000000000000007,11,93.833171976761818,7.93,15,53.6,null,15,49,1000,190,2400,"grumligt",2016,4]
[13,"22b Spångholmsbäcken, bron vid Torupsvägen","2016-06-15",14,7.1,69.125711057924804,7.81,6.2,72.2,null,8.6,88,4500,49,4600,"klart vatten",2016,6]
[13,"22b Spångholmsbäcken, bron vid Torupsvägen","2016-08-16",13.4,7,67.263539857585627,7.84,6.7,65.8,null,11,70,2900,30,3100,"lågflöde",2016,8]
[13,"22b Spångholmsbäcken, bron vid Torupsvägen","2016-10-17",9.3000000000000007,7.7,67.306358314874629,7.75,3,66.099999999999994,null,11,63,1600,13,2700,"klart vatten",2016,10]
[13,"22b Spångholmsbäcken, bron vid Torupsvägen","2016-12-15",2.2000000000000002,12.5,90.866380317277944,7.78,9.4,51,null,16,59,800,310,2600,null,2016,12]
[13,"22b Spångholmsbäcken, bron vid Torupsvägen","2017-02-21",4.4000000000000004,12,92.6127904975109,7.83,4.3,54.1,null,13,48,920,340,2400,"klart",2017,2]
[13,"22b Spångholmsbäcken, bron vid Torupsvägen","2017-04-18",6.9,11.8,97.191393122518662,7.91,13,52.9,null,15,45,690,38,2400,null,2017,4]
[13,"22b Spångholmsbäcken, bron vid Torupsvägen","2017-06-21",15.6,7.6,76.5593914048263,7.78,6.3,54.1,null,16,120,780,75,2100,"klart vatten",2017,6]
[13,"22b Spångholmsbäcken, bron vid Torupsvägen","2017-08-22",14.7,6.5,64.245375050610008,7.82,3,66.5,null,12,84,1900,48,2400,null,2017,8]
[13,"22b Spångholmsbäcken, bron vid Torupsvägen","2017-10-17",12,8.6999999999999993,81.018981612644254,7.77,11,49.1,null,19,98,340,"<10",2100,null,2017,10]
[13,"22b Spångholmsbäcken, bron vid Torupsvägen","2017-12-19",2.2999999999999998,12.7,92.57661156981348,7.79,11,50.6,null,19,56,1100,290,2500,"högflöde",2017,12]
[13,"22b Spångholmsbäcken, bron vid Torupsvägen","2018-02-19",1.8,12.5,89.85958755584042,7.78,13,54.5,null,17,55,1300,490,2400,null,2018,2]
[13,"22b Spångholmsbäcken, bron vid Torupsvägen","2018-04-16",10.7,10.3,93.082439404041239,7.91,8.3000000000000007,54.2,null,16,46,1000,320,2300,null,2018,4]
[13,"22b Spångholmsbäcken, bron vid Torupsvägen","2018-06-20",14.8,6.6,65.373056153950287,7.81,3.1,76.8,null,7.6,85,5600,45,5900,null,2018,6]
[13,"22b Spångholmsbäcken, bron vid Torupsvägen","2018-08-17",17.600000000000001,5.5,57.709499047409786,7.8,3.4,"79.8",null,6.4,50,3100,53,3800,"stillastående",2018,8]
[13,"22b Spångholmsbäcken, bron vid Torupsvägen","2018-10-16",10.3,4.5999999999999996,41.181335862500141,7.75,2.6,81,null,6.4,34,2000,"<10",2400,"nästan stillastående",2018,10]
[13,"22b Spångholmsbäcken, bron vid Torupsvägen","2018-12-11",6.1,9.6,77.468522965618064,7.63,1.7,90.7,null,12,37,10000,33,10000,null,2018,12]
[13,"22b Spångholmsbäcken, bron vid Torupsvägen","2019-02-20",5.2,12,95,7.87,9.6,54.2,null,21,70,2600,540,4400,null,2019,2]
[13,"22b Spångholmsbäcken, bron vid Torupsvägen","2019-04-16",6.8,12.1,99,7.91,9,60.4,null,19,110,2500,120,4000,null,2019,4]
[13,"22b Spångholmsbäcken, bron vid Torupsvägen","2019-06-18",15.1,6,60,7.63,2.2999999999999998,71.900000000000006,null,17,76,5100,65,5700,null,2019,6]
[13,"22b Spångholmsbäcken, bron vid Torupsvägen","2019-08-20",16,7.6,77,7.89,2,70.400000000000006,null,6.5,82,2800,39,3100,null,2019,8]
[13,"22b Spångholmsbäcken, bron vid Torupsvägen","2019-10-16",11.6,7.7,71,7.51,2.4,80,null,17,53,5900,23,6800,null,2019,10]
[13,"22b Spångholmsbäcken, bron vid Torupsvägen","2019-12-11",4.5,11.2,87,7.73,12,56.9,null,17,81,2500,260,4000,null,2019,12]
[13,"22b Spångholmsbäcken, bron vid Torupsvägen","2020-02-12",4.4000000000000004,12.1,93,7.77,9.3000000000000007,55.5,null,18,79,2500,560,4200,null,2020,2]
[13,"22b Spångholmsbäcken, bron vid Torupsvägen","2020-04-20",7.1,10,83,7.84,3.9,73,null,14,87,4200,150,5100,null,2020,4]
[13,"22b Spångholmsbäcken, bron vid Torupsvägen","2020-06-15",15,5.5,55,7.79,3.1,74.7,null,10,59,4200,110,5000,null,2020,6]
[13,"22b Spångholmsbäcken, bron vid Torupsvägen","2020-08-18",16.100000000000001,5.0999999999999996,52,7.81,1.5,77.099999999999994,null,5.9,39,3400,43,4200,null,2020,8]
[13,"22b Spångholmsbäcken, bron vid Torupsvägen","2020-10-19",6.7,8.6999999999999993,71,7.81,2.8,77.3,null,7.1,42,3000,22,3400,null,2020,10]
[13,"22b Spångholmsbäcken, bron vid Torupsvägen","2020-12-14",5.5,9.5,75,7.75,1.6,85.7,null,13,58,2600,82,3600,null,2020,12]
[15,"23 Spångholmsbäcken, uppströms Torupsdammen","2011-02-22",0.3,13.7,94.390052531253758,7.77,14,52.6,null,20,51,700,580,2400,"is i kanten",2011,2]
[15,"23 Spångholmsbäcken, uppströms Torupsdammen","2011-04-11",11.4,10.8,99.202245762494854,8.08,5.6,49.2,null,16,49,580,310,2000,null,2011,4]
[15,"23 Spångholmsbäcken, uppströms Torupsdammen","2011-06-21",13.6,7.4,71.420396542241633,7.73,5.3,59.9,null,14,140,870,91,1700,"lågflöde",2011,6]
[15,"23 Spångholmsbäcken, uppströms Torupsdammen","2011-08-16",17.3,8.1,84.483405097792229,7.77,12,43.6,null,22,83,"<10","<10",1800,"högflöde, grumligt",2011,8]
[15,"23 Spångholmsbäcken, uppströms Torupsdammen","2011-10-11",10.9,9.6,87.163011614178359,7.74,7.5,49.5,null,24,75,100,120,1600,"klart vatten",2011,10]
[15,"23 Spångholmsbäcken, uppströms Torupsdammen","2011-12-19",2.8,13,96.07942350360446,8,8.9,49.6,null,17,46,230,200,1900,null,2011,12]
[15,"23 Spångholmsbäcken, uppströms Torupsdammen","2012-02-13",0.1,14,95.904275368255597,7.9,6.7,57.5,null,23,44,660,310,1900,"is i kanten",2012,2]
[15,"23 Spångholmsbäcken, uppströms Torupsdammen","2012-04-16",7.6,11.1,93.053429332598967,7.97,6.7,50.9,null,19,120,180,120,1700,"grumligt",2012,4]
[15,"23 Spångholmsbäcken, uppströms Torupsdammen","2012-06-19",15,7,69.630392830925615,7.8,8,67.900000000000006,null,13,130,1000,310,2200,"klart vatten",2012,6]
[15,"23 Spångholmsbäcken, uppströms Torupsdammen","2012-08-20",18.899999999999999,5.3,57.041307551996191,7.76,6.1,81.7,null,9,130,1300,200,2200,"klart vatten",2012,8]
[15,"23 Spångholmsbäcken, uppströms Torupsdammen","2012-10-10",9,8.5,73.761091175200249,7.64,5,69.099999999999994,null,9.6999999999999993,84,390,71,1200,"klart, lågflöde",2012,10]
[15,"23 Spångholmsbäcken, uppströms Torupsdammen","2012-12-10",0.2,13.7,94.119457013900828,7.89,15,48.8,null,18,85,130,160,1800,"istäckt",2012,12]
[15,"23 Spångholmsbäcken, uppströms Torupsdammen","2013-02-18",1.3,13.5,95.69552271335516,7.95,5,47.5,null,19,26,290,390,2100,null,2013,2]
[15,"23 Spångholmsbäcken, uppströms Torupsdammen","2013-04-15",10.1,11.8,105.13979873794521,8,5.5,52.4,null,16,31,430,370,1800,null,2013,4]
[15,"23 Spångholmsbäcken, uppströms Torupsdammen","2013-06-17",17.100000000000001,6.8,70.640222396310676,7.7,3.3,55.3,null,14,110,260,96,1100,"klart ",2013,6]
[15,"23 Spångholmsbäcken, uppströms Torupsdammen","2013-08-20",15.5,6.7,67.352119690110285,7.8,3.6,60.8,null,11,170,810,63,1600,"klart vatten",2013,8]
[15,"23 Spångholmsbäcken, uppströms Torupsdammen","2013-10-14",11.7,6.2,57.343535273132019,7.47,3.3,55.3,null,12,130,340,57,1500,null,2013,10]
[15,"23 Spångholmsbäcken, uppströms Torupsdammen","2013-12-12",3.8,12.8,97.210663702494244,7.94,19,45.9,null,20,73,410,92,2400,null,2013,12]
[15,"23 Spångholmsbäcken, uppströms Torupsdammen","2014-02-18",3.1,13.3,99.107492987839237,8.02,8.1999999999999993,46.6,null,15,52,810,310,2600,"Högflöde",2014,2]
[15,"23 Spångholmsbäcken, uppströms Torupsdammen","2014-04-14",9.1999999999999993,11,95.919736370088202,8.02,17,47.9,null,20,69,67,"<10",2000,"Måttligt flöde",2014,4]
[15,"23 Spångholmsbäcken, uppströms Torupsdammen","2014-06-11",15.1,4.7,46.850936480123117,7.63,6.3,65.599999999999994,null,13,130,1100,2100,4400,"Klart vatten",2014,6]
[15,"23 Spångholmsbäcken, uppströms Torupsdammen","2014-08-18",13.9,7.4,71.890031546771297,7.61,7,52.5,null,14,160,590,95,1500,"Klart vatten",2014,8]
[15,"23 Spångholmsbäcken, uppströms Torupsdammen","2014-10-20",12.9,8.1,76.975969424159032,7.62,14,41.9,null,22,110,2300,87,3900,"Högflöde, klart",2014,10]
[15,"23 Spångholmsbäcken, uppströms Torupsdammen","2014-12-10",3.5,12.3,92.658816487574569,7.86,8,47,null,18,31,270,250,2100,"Klart",2014,12]
[15,"23 Spångholmsbäcken, uppströms Torupsdammen","2015-02-10",2.7,13.5,99.500947455342569,7.95,7.3,45.9,null,17,42,740,360,2600,null,{"$f":"YEAR(C391)","v":2015},{"$f":"MONTH(C391)","v":2}]
[15,"23 Spångholmsbäcken, uppströms Torupsdammen","2015-04-13",10.5,11.2,100.74165661397294,7.95,11,47.1,null,21,63,370,13,2100,"ngt grumligt",2015,4]
[15,"23 Spångholmsbäcken, uppströms Torupsdammen","2015-06-15",13.9,7.7,74.804492285153913,7.66,5.3,58.5,null,15,119,390,110,2100,"klartvatten",2015,6]
[15,"23 Spångholmsbäcken, uppströms Torupsdammen","2015-08-18",17.100000000000001,4.8,49.863686397395774,7.69,7.1,72.5,null,11,130,600,86,1400,"lågflöde",2015,8]
[15,"23 Spångholmsbäcken, uppströms Torupsdammen","2015-10-19",7.8,8.5,71.613989997965874,7.6,3.9,65.599999999999994,null,11,93,820,95,1500,"klart vatten",2015,10]
[15,"23 Spångholmsbäcken, uppströms Torupsdammen","2015-12-09",5.9,12,96.336351220812688,8.0399999999999991,17,43.9,null,22,76,430,190,2700,null,2015,12]
[15,"23 Spångholmsbäcken, uppströms Torupsdammen","2016-02-23",3.9,11.7,89.09627558510546,7.94,8,44.9,null,16,45,760,570,2300,"klart vatten",2016,2]
[15,"23 Spångholmsbäcken, uppströms Torupsdammen","2016-04-19",9.3000000000000007,11,96.151940449820884,8.01,5.7,50,null,16,61,360,290,1900,"grumligt",2016,4]
[15,"23 Spångholmsbäcken, uppströms Torupsdammen","2016-06-15",17.100000000000001,7.1,73.756702796147906,7.8,4.4000000000000004,61,null,14,120,730,94,1800,null,2016,6]
[15,"23 Spångholmsbäcken, uppströms Torupsdammen","2016-08-16",14.3,7.1,69.575935136491125,7.74,5.7,56,null,12,170,680,80,1400,"lågflöde",2016,8]
[15,"23 Spångholmsbäcken, uppströms Torupsdammen","2016-10-17",9.1999999999999993,7.5,65.399820252332873,7.64,5.5,69.5,null,12,110,630,260,1700,"klart vatten",2016,10]
[15,"23 Spångholmsbäcken, uppströms Torupsdammen","2016-12-15",2.1,13.3,96.413614875736798,7.91,6.7,47.2,null,16,54,310,280,2100,null,2016,12]
[15,"23 Spångholmsbäcken, uppströms Torupsdammen","2017-02-21",4.4000000000000004,12.2,94.15633700580274,7.75,4.8,48.5,null,15,42,360,430,2100,"klart",2017,2]
[15,"23 Spångholmsbäcken, uppströms Torupsdammen","2017-04-18",7,11.9,98.263955017716896,8.0500000000000007,12,49.7,null,18,67,200,20,2000,null,2017,4]
[15,"23 Spångholmsbäcken, uppströms Torupsdammen","2017-06-21",15.6,7.6,76.5593914048263,7.86,5.0999999999999996,49.8,null,16,110,350,68,1600,"klart vatten",2017,6]
[15,"23 Spångholmsbäcken, uppströms Torupsdammen","2017-08-22",15.9,6.5,65.888566702894067,7.66,6.6,58.4,null,13,180,580,160,1600,null,2017,8]
[15,"23 Spångholmsbäcken, uppströms Torupsdammen","2017-10-17",12.9,8.8000000000000007,83.628213695382655,7.86,12,46.1,null,20,96,"<10","<10",2000,null,2017,10]
[15,"23 Spångholmsbäcken, uppströms Torupsdammen","2017-12-19",2,13.5,97.591470348639291,7.99,9.1,47.8,null,19,51,380,310,2100,"högflöde",2017,12]
[15,"23 Spångholmsbäcken, uppströms Torupsdammen","2018-02-19",1.2,13,91.891535232829796,7.93,12,51.5,null,18,41,590,510,2100,null,2018,2]
[15,"23 Spångholmsbäcken, uppströms Torupsdammen","2018-04-16",10.8,10.5,95.112191307266656,8,7.2,52.1,null,16,44,560,340,2100,null,2018,4]
[15,"23 Spångholmsbäcken, uppströms Torupsdammen","2018-06-20",15.1,6.4,63.797019887827219,7.77,4.3,58.3,null,10,110,830,100,1500,null,2018,6]
[15,"23 Spångholmsbäcken, uppströms Torupsdammen","2018-08-17",17.7,5.5,57.824108465402702,7.6,2.2999999999999998,64.099999999999994,null,10,87,110,12,900,null,2018,8]
[15,"23 Spångholmsbäcken, uppströms Torupsdammen","2018-10-16",10.8,3,27.174911802076192,7.6,1.6,70.2,null,12,97,43,480,1300,"nästan stillastående",2018,10]
[15,"23 Spångholmsbäcken, uppströms Torupsdammen","2018-12-11",5.4,9.4,74.487844375198208,7.48,0.93,81.7,null,13,34,1800,59,2800,null,2018,12]
[15,"23 Spångholmsbäcken, uppströms Torupsdammen","2019-02-20",5,12,94,7.99,9.1,50.5,null,21,69,1400,630,3600,null,2019,2]
[15,"23 Spångholmsbäcken, uppströms Torupsdammen","2019-04-16",6.9,12.1,100,7.93,16,54.6,null,21,99,670,32,2700,null,2019,4]
[15,"23 Spångholmsbäcken, uppströms Torupsdammen","2019-06-18",15.7,5.8,59,7.57,2.1,61.3,null,18,140,400,130,1600,null,2019,6]
[15,"23 Spångholmsbäcken, uppströms Torupsdammen","2019-08-20",16.7,5.2,54,7.64,1.8,69.3,null,"9.8",130,830,71,1600,null,2019,8]
[15,"23 Spångholmsbäcken, uppströms Torupsdammen","2019-10-16",11.6,6.6,61,7.37,1.3,71.8,null,20,94,970,130,3800,null,2019,10]
[15,"23 Spångholmsbäcken, uppströms Torupsdammen","2019-12-11",4.0999999999999996,11.1,85,7.83,12,49.4,null,19,92,680,320,2700,null,2019,12]
[15,"23 Spångholmsbäcken, uppströms Torupsdammen","2020-02-12",4.0999999999999996,12.5,96,7.9,13,51.4,null,19,83,1200,670,3500,null,2020,2]
[15,"23 Spångholmsbäcken, uppströms Torupsdammen","2020-04-20",8.1,10.5,89,8.0399999999999991,6.7,66.7,null,18,130,580,240,2000,null,2020,4]
[15,"23 Spångholmsbäcken, uppströms Torupsdammen","2020-06-15",15.3,4.4000000000000004,44,7.49,7.9,67.599999999999994,null,14,240,580,270,2100,"stillastående",2020,6]
[15,"23 Spångholmsbäcken, uppströms Torupsdammen","2020-08-18",null,null,null,null,null,null,null,null,null,null,null,null,"vattendraget torrt",2020,8]
[15,"23 Spångholmsbäcken, uppströms Torupsdammen","2020-10-19",6.2,6.9,56,7.57,2.2000000000000002,71.599999999999994,null,11,93,1300,190,2100,null,2020,10]
[15,"23 Spångholmsbäcken, uppströms Torupsdammen","2020-12-14",4.7,9.5,74,7.65,1.8,82.6,null,16,110,440,150,1900,null,2020,12]
[17,"10 Torrebergabäcken, vägbron nordost Mölleberga","2011-02-22",0.5,11.9,82.459357404974611,7.55,12,62.7,null,12,92,4100,230,5300,"is i kanten",2011,2]
[17,"10 Torrebergabäcken, vägbron nordost Mölleberga","2011-04-11",9.6999999999999993,10.3,90.903467436880604,7.87,6.1,61.8,null,14,64,2400,44,2400,null,2011,4]
[17,"10 Torrebergabäcken, vägbron nordost Mölleberga","2011-06-21",16.5,10.8,110.83675354509093,7.98,4,58.4,null,9.3000000000000007,42,770,27,1300,"stillastående",2011,6]
[17,"10 Torrebergabäcken, vägbron nordost Mölleberga","2011-08-16",17.8,3.6,37.9234800286577,7.58,1.1000000000000001,62.8,null,19,61,820,29,1900,"högflöde, ganska klart",2011,8]
[17,"10 Torrebergabäcken, vägbron nordost Mölleberga","2011-10-11",11.5,8.1,74.573300000324849,7.63,7.8,64.900000000000006,null,16,86,2500,59,3300,"klart vatten",2011,10]
[17,"10 Torrebergabäcken, vägbron nordost Mölleberga","2011-12-19",3.7,11.2,84.830110955072186,7.7,18,66,null,11,84,5500,86,6300,"grumligt",2011,12]
[17,"10 Torrebergabäcken, vägbron nordost Mölleberga","2012-02-13",0.8,12.4,86.66222904011866,7.6,29,67.900000000000006,null,12,110,3200,310,4100,"istäckt, grumligt",2012,2]
[17,"10 Torrebergabäcken, vägbron nordost Mölleberga","2012-04-16",6.6,9.6,78.469206956902326,7.79,10,64.3,null,14,72,1900,120,3500,"grumligt",2012,4]
[17,"10 Torrebergabäcken, vägbron nordost Mölleberga","2012-06-19",15.4,8.4,84.264587470474552,7.8,5.9,62.5,null,10,66,800,41,1500,"grumligt, stillastående",2012,6]
[17,"10 Torrebergabäcken, vägbron nordost Mölleberga","2012-08-20",20.2,6.9,76.106260227744841,7.96,2.7,58.8,null,7.2,67,520,39,710,"klart vatten",2012,8]
[17,"10 Torrebergabäcken, vägbron nordost Mölleberga","2012-10-10",8.5,11.5,98.582495145688625,8.08,4.5,63,null,7.2,60,790,17,1400,"klart vatten",2012,10]
[17,"10 Torrebergabäcken, vägbron nordost Mölleberga","2012-12-10",0.2,12,82.440400304146706,7.79,6.8,70,null,11,61,2700,150,3300,"mest istäckt",2012,12]
[17,"10 Torrebergabäcken, vägbron nordost Mölleberga","2013-02-18",1.2,12,84.822955599535206,7.64,10,63.4,null,14,74,4300,150,5000,"grumligt",2013,2]
[17,"10 Torrebergabäcken, vägbron nordost Mölleberga","2013-04-15",10,12,106.66803004243644,7.9,7.8,64.2,null,12,65,1700,30,2600,null,2013,4]
[17,"10 Torrebergabäcken, vägbron nordost Mölleberga","2013-06-17",18,9,95.1832230162358,7.8,5.3,55.1,null,9,73,1000,73,1800,"grumligt",2013,6]
[17,"10 Torrebergabäcken, vägbron nordost Mölleberga","2013-08-20",16.7,6,61.827435029952483,7.5,2.1,60.6,null,10,73,280,38,2800,"klart vatten",2013,8]
[17,"10 Torrebergabäcken, vägbron nordost Mölleberga","2013-10-14",11.5,8.9,81.938564197887814,7.91,5.6,65.3,null,7.4,54,720,81,1400,null,2013,10]
[17,"10 Torrebergabäcken, vägbron nordost Mölleberga","2013-12-12",5.5,10.8,85.805672452978172,7.63,8.6999999999999993,70.400000000000006,null,13,71,10000,70,9700,null,2013,12]
[17,"10 Torrebergabäcken, vägbron nordost Mölleberga","2014-02-18",3.8,11.7,88.856622290561134,7.68,7.8,62,null,12,63,7100,69,8000,"Högflöde, grumligt",2014,2]
[17,"10 Torrebergabäcken, vägbron nordost Mölleberga","2014-04-14",8.3000000000000007,10.5,89.56802779599991,7.87,6.4,63.6,null,13,55,2200,29,3600,"Måttligt flöde",2014,4]
[17,"10 Torrebergabäcken, vägbron nordost Mölleberga","2014-06-11",18.899999999999999,5.7,61.346311895543082,7.66,6.2,65.099999999999994,null,9.9,74,620,80,1500,"Stillastående",2014,6]
[17,"10 Torrebergabäcken, vägbron nordost Mölleberga","2014-08-18",15,6.1,60.677913752663748,7.49,3.1,64.5,null,8.9,88,390,49,920,"Något grumligt",2014,8]
[17,"10 Torrebergabäcken, vägbron nordost Mölleberga","2014-10-20",13.1,7.6,72.54627302539599,7.64,46,58.9,null,14,210,8200,200,8400,"Högflöde, grumligt",2014,10]
[17,"10 Torrebergabäcken, vägbron nordost Mölleberga","2014-12-10",4.9000000000000004,11,86.028780360260598,7.82,16,73.599999999999994,null,14,85,5800,94,6100,"Grumligt",2014,12]
[17,"10 Torrebergabäcken, vägbron nordost Mölleberga","2015-02-10",3.3,11.7,87.661407544892086,7.67,13,62,null,13,77,4700,130,5800,null,2015,2]
[17,"10 Torrebergabäcken, vägbron nordost Mölleberga","2015-04-13",8.9,11.5,99.551874339014617,7.9,12,58,null,12,78,3400,98,4200,null,2015,4]
[17,"10 Torrebergabäcken, vägbron nordost Mölleberga","2015-06-15",17.399999999999999,11.2,117.05034719974718,7.9,13,64.3,null,12,90,430,50,1700,"grumligt",2015,6]
[17,"10 Torrebergabäcken, vägbron nordost Mölleberga","2015-08-18",17.7,6.8,71.491625011770608,7.48,3.9,63.3,null,8.6999999999999993,58,200,33,790,"ytan täckt av andmat",2015,8]
[17,"10 Torrebergabäcken, vägbron nordost Mölleberga","2015-10-19",8.6,8.8000000000000007,75.622391369639004,7.8,5.2,64.099999999999994,null,7.4,56,890,39,1500,"grumligt",{"$f":"YEAR(C455)","v":2015},{"$f":"MONTH(C455)","v":10}]
[17,"10 Torrebergabäcken, vägbron nordost Mölleberga","2015-12-09",6.8,9,73.94087875713484,7.71,6.2,66.2,null,15,90,6700,210,7000,"klart vatten",2015,12]
[17,"10 Torrebergabäcken, vägbron nordost Mölleberga","2016-02-23",4.4000000000000004,11.4,87.982150972635353,7.76,19,58.3,null,12,82,6200,70,6500,"grumligt",2016,2]
[17,"10 Torrebergabäcken, vägbron nordost Mölleberga","2016-04-19",9.3000000000000007,12.2,106.64124304434679,8.09,10,63.3,null,12,73,2200,36,3100,"grumligt",2016,4]
[17,"10 Torrebergabäcken, vägbron nordost Mölleberga","2016-06-15",17,7.9,81.902145951201703,7.68,7.3,65.8,null,8.6,79,780,52,1600,"klart vatten",2016,6]
[17,"10 Torrebergabäcken, vägbron nordost Mölleberga","2016-08-16",15.1,2.6,25.917539329429811,7.4,6.6,63.9,null,9.3000000000000007,270,550,62,1200,"ytan täckt med andmat",2016,8]
[17,"10 Torrebergabäcken, vägbron nordost Mölleberga","2016-10-17",8.5,8.9,76.294278851880776,7.79,11,61.7,null,7.1,100,910,120,1600,"nästan stillast",2016,10]
[17,"10 Torrebergabäcken, vägbron nordost Mölleberga","2016-12-15",2.4,11.6,84.792559925007325,7.72,12,72,null,12,77,7100,110,7700,"grumligt",2016,12]
[17,"10 Torrebergabäcken, vägbron nordost Mölleberga","2017-02-21",5.5,11.6,92.161648190235809,7.9,25,71.400000000000006,null,10,140,8000,150,8500,"grumligt",2017,2]
[17,"10 Torrebergabäcken, vägbron nordost Mölleberga","2017-04-18",5.9,13,104.36438048921374,7.87,6.5,65.599999999999994,null,12,56,4100,25,5100,"grumligt",2017,4]
[17,"10 Torrebergabäcken, vägbron nordost Mölleberga","2017-06-21",18.399999999999999,4.9000000000000004,52.229021572409906,7.68,3.5,60.4,null,11,87,1400,81,2200,"klart vatten",2017,6]
[17,"10 Torrebergabäcken, vägbron nordost Mölleberga","2017-08-22",16.5,3.6,36.945584515030305,7.47,5.2,60.5,null,8.9,86,580,36,1200,"stillast. ",2017,8]
[17,"10 Torrebergabäcken, vägbron nordost Mölleberga","2017-10-17",12.6,4.7,44.366387689729578,7.64,3.5,71.7,null,17,100,2700,59,3400,null,2017,10]
[17,"10 Torrebergabäcken, vägbron nordost Mölleberga","2017-12-19",3.3,9.8000000000000007,73.425794353841255,7.58,9.6,65.7,null,15,71,6400,110,6600,"högflöde",2017,12]
[17,"10 Torrebergabäcken, vägbron nordost Mölleberga","2018-02-19",2.1,11.8,85.539898912307848,7.68,17,65.8,null,13,88,4500,230,4500,null,2018,2]
[17,"10 Torrebergabäcken, vägbron nordost Mölleberga","2018-04-16",9.4,10.199999999999999,89.374447916204574,7.83,9.8000000000000007,63.1,null,13,88,3200,110,3800,null,2018,4]
[17,"10 Torrebergabäcken, vägbron nordost Mölleberga","2018-06-20",18.899999999999999,6.6,71.032571668523559,7.67,4.8,61.5,null,8.8000000000000007,72,500,44,960,"stillastående",2018,6]
[17,"10 Torrebergabäcken, vägbron nordost Mölleberga","2018-08-17",19.600000000000001,3.9,42.536610256677193,7.49,3.7,60.7,null,10,130,310,80,1000,"stillastående",2018,8]
[17,"10 Torrebergabäcken, vägbron nordost Mölleberga","2018-10-16",10.199999999999999,8.9,79.488627372334392,7.85,8.6999999999999993,67.400000000000006,null,"8.8",180,540,62,1300,null,2018,10]
[17,"10 Torrebergabäcken, vägbron nordost Mölleberga","2018-12-11",4.7,11,85.574781347990154,7.75,6,78.8,null,11,66,6200,130,6600,null,2018,12]
[17,"10 Torrebergabäcken, vägbron nordost Mölleberga","2019-02-20",5.8,11.2,90,7.72,9.1,76.7,null,13,52,13000,63,13000,null,2019,2]
[17,"10 Torrebergabäcken, vägbron nordost Mölleberga","2019-04-16",6.3,12,97,7.91,13,67.400000000000006,null,12,81,4100,44,4700,null,2019,4]
[17,"10 Torrebergabäcken, vägbron nordost Mölleberga","2019-06-18",18.5,3.9,42,7.52,3.7,50.8,null,10,98,1000,73,1600,null,2019,6]
[17,"10 Torrebergabäcken, vägbron nordost Mölleberga","2019-08-20",15.8,5,51,7.5,3.3,59.3,null,6.2,87,110,35,560,null,2019,8]
[17,"10 Torrebergabäcken, vägbron nordost Mölleberga","2019-10-16",12.2,4,37,7.56,2.7,66.400000000000006,null,14,98,1600,98,4300,null,2019,10]
[17,"10 Torrebergabäcken, vägbron nordost Mölleberga","2019-12-11",4.7,10.6,82,7.78,7.3,77,null,15,92,8500,88,9200,null,2019,12]
[17,"10 Torrebergabäcken, vägbron nordost Mölleberga","2020-02-12",4.7,11.7,91,7.75,48,62.1,null,15,140,9800,86,13000,"grumligt",2020,2]
[17,"10 Torrebergabäcken, vägbron nordost Mölleberga","2020-04-20",8.9,10.4,90,7.83,5.0999999999999996,64.7,null,11,78,2900,32,3800,null,2020,4]
[17,"10 Torrebergabäcken, vägbron nordost Mölleberga","2020-06-15",18.7,7.6,81,7.69,5.9,62.2,null,9.9,110,590,86,1300,null,2020,6]
[17,"10 Torrebergabäcken, vägbron nordost Mölleberga","2020-08-18",16.3,1.6,16,7.29,13,67.400000000000006,null,7.9,170,31,34,970,null,2020,8]
[17,"10 Torrebergabäcken, vägbron nordost Mölleberga","2020-10-19",6.5,7.3,60,7.67,4.3,67.599999999999994,null,7.5,120,900,43,1400,null,2020,10]
[17,"10 Torrebergabäcken, vägbron nordost Mölleberga","2020-12-14",5,9.1,71,7.86,5,75.8,null,11,60,2400,81,3300,null,2020,12]
[18,"15 Risebergabäcken, ca 250 m uppströms från Sege å","2011-02-22",1.1000000000000001,14.2,100.09045910407859,8.01,9.1999999999999993,105.3,null,6.5,52,4000,44,4800,"isfritt",2011,2]
[18,"15 Risebergabäcken, ca 250 m uppströms från Sege å","2011-04-11",11.3,11.6,106.30480393959188,8.23,3.6,102,null,6.4,42,2400,27,3300,"klart vatten",2011,4]
[18,"15 Risebergabäcken, ca 250 m uppströms från Sege å","2011-06-21",13.5,9.4,90.52428156960481,7.9,4.9000000000000004,95.8,null,7.2,69,1600,26,2300,"lågflöde",2011,6]
[18,"15 Risebergabäcken, ca 250 m uppströms från Sege å","2011-08-16",18.3,8.8000000000000007,93.616481593252018,7.87,5.3,88.6,null,7.6,92,2600,45,3400,"högflöde",2011,8]
[18,"15 Risebergabäcken, ca 250 m uppströms från Sege å","2011-10-11",12.3,10,93.76095151377271,7.92,8.3000000000000007,77,null,6.9,92,1900,38,1900,"grumligt",2011,10]
[18,"15 Risebergabäcken, ca 250 m uppströms från Sege å","2011-12-19",5.0999999999999996,11.9,93.559356952449164,8,6.7,89.7,null,6.3,61,3800,55,4300,"grumligt",2011,12]
[18,"15 Risebergabäcken, ca 250 m uppströms från Sege å","2012-02-13",1.9,14,100.92420922421314,7.9,21,228,null,7.8,74,3300,110,4200,"svag oljehinna och lukt",2012,2]
[18,"15 Risebergabäcken, ca 250 m uppströms från Sege å","2012-04-16",7,12,99.089702538874178,8.0500000000000007,3.2,99.5,null,6.5,35,2500,32,3100,"klart vatten",2012,4]
[18,"15 Risebergabäcken, ca 250 m uppströms från Sege å","2012-06-19",14.1,8.5,82.935840318300606,7.8,4.9000000000000004,68.3,null,7.8,120,3300,100,4100,"klart vatten",2012,6]
[18,"15 Risebergabäcken, ca 250 m uppströms från Sege å","2012-08-20",16.600000000000001,8.1,83.297341924502334,8.01,2.6,105.3,null,4.5,150,2400,130,3100,"klart vatten",2012,8]
[18,"15 Risebergabäcken, ca 250 m uppströms från Sege å","2012-10-10",10.3,10.8,96.686614633695996,7.7,28,27.6,null,6.7,88,500,44,2000,"högflöde, grågrumligt",2012,10]
[18,"15 Risebergabäcken, ca 250 m uppströms från Sege å","2012-12-10",4.8,11.7,91.26180529732774,8.0399999999999991,5.2,327,null,5.4,61,1900,170,2500,"oljefläckar och lukt",2012,12]
[18,"15 Risebergabäcken, ca 250 m uppströms från Sege å","2013-02-18",2.5,13,95.289085428923599,7.93,46,240,null,13,110,3300,130,4200,"mkt grumligt, utflöde fr kulvert ",2013,2]
[18,"15 Risebergabäcken, ca 250 m uppströms från Sege å","2013-04-15",11.1,13.5,123.14484036710942,8.1999999999999993,3.4,106,null,5.8,32,1700,23,2500,null,2013,4]
[18,"15 Risebergabäcken, ca 250 m uppströms från Sege å","2013-06-17",16.100000000000001,9.4,95.680021644642238,7.9,3,96.7,null,5.8,82,2200,62,2800,"klart vatten",2013,6]
[18,"15 Risebergabäcken, ca 250 m uppströms från Sege å","2013-08-20",15.9,9.3000000000000007,94.271333897986906,8,2.6,104,null,5,94,1100,84,1500,"klart vatten",2013,8]
[18,"15 Risebergabäcken, ca 250 m uppströms från Sege å","2013-10-14",12.3,9,84.384856362395439,7.79,11,42.1,null,4.5,100,760,37,1300,"grumligt",2013,10]
[18,"15 Risebergabäcken, ca 250 m uppströms från Sege å","2013-12-12",6.6,12.1,98.903896268595631,8.02,3.4,101.8,null,6.7,63,4800,48,5500,"grumligt",2013,12]
[18,"15 Risebergabäcken, ca 250 m uppströms från Sege å","2014-02-18",4.8,12.5,97.501928736461267,8.0299999999999994,3.3,102,null,5.4,54,5200,45,5900,"Högflöde",2014,2]
[18,"15 Risebergabäcken, ca 250 m uppströms från Sege å","2014-04-14",8.8000000000000007,11,94.991607713134883,7.77,27,49.6,null,6.5,84,1200,180,2300,"Stort utflöde fr. kulvert",2014,4]
[18,"15 Risebergabäcken, ca 250 m uppströms från Sege å","2014-06-11",15.7,9.5,95.899129002379638,8,3,110,null,6.1,110,2800,80,4400,"Något grumligt",2014,6]
[18,"15 Risebergabäcken, ca 250 m uppströms från Sege å","2014-08-18",16.3,9.1,93.0084871172199,7.64,20,21.4,null,15,190,560,210,1700,"Grågrumligt, utflöde fr kulvert",2014,8]
[18,"15 Risebergabäcken, ca 250 m uppströms från Sege å","2014-10-20",13.4,9.3000000000000007,89.364417239363775,7.77,50,61,null,9.3000000000000007,190,3600,39,4100,"Högflöde, grumligt",2014,10]
[18,"15 Risebergabäcken, ca 250 m uppströms från Sege å","2014-12-10",6.1,11.8,95.22172614523889,8.0500000000000007,44,67.900000000000006,null,6.7,110,2700,87,3000,"Grågrumligt",2014,12]
[18,"15 Risebergabäcken, ca 250 m uppströms från Sege å","2015-02-10",5.2,12.6,99.323521232862774,8.0299999999999994,5.2,102,null,5.4,53,3600,72,4400,"grumligt",2015,2]
[18,"15 Risebergabäcken, ca 250 m uppströms från Sege å","2015-04-13",9.1,12.2,106.12624580795347,7.98,5.8,56.9,null,5.3,54,1800,210,2600,"grumligt",2015,4]
[18,"15 Risebergabäcken, ca 250 m uppströms från Sege å","2015-06-15",13.9,10.5,102.0061258433917,8.0399999999999991,3.3,111,null,6,75,2100,76,2600,"grumligt",2015,6]
[18,"15 Risebergabäcken, ca 250 m uppströms från Sege å","2015-08-18",16.600000000000001,9.4,96.666051122261976,8.0500000000000007,13,105,null,5.8,120,1500,66,2000,"lågflöde, grumligt",2015,8]
[18,"15 Risebergabäcken, ca 250 m uppströms från Sege å","2015-10-19",10.199999999999999,11.3,100.92376284352569,8.1199999999999992,2.9,86.4,null,4.5,70,1400,34,1800,"klart vatten",2015,10]
[18,"15 Risebergabäcken, ca 250 m uppströms från Sege å","2015-12-09",8.3000000000000007,11.2,95.539229649066584,8.02,14,62.5,null,5.3,80,3300,87,3400,null,2015,12]
[18,"15 Risebergabäcken, ca 250 m uppströms från Sege å","2016-02-23",5.4,12.4,98.260560665155083,8.07,3,96,null,5.5,53,4400,30,4500,"rel klart vatten",2016,2]
[18,"15 Risebergabäcken, ca 250 m uppströms från Sege å","2016-04-19",9.6,13,114.45782304913313,8.19,3.5,99.6,null,6.1,40,2000,26,2500,"grumligt",2016,4]
[18,"15 Risebergabäcken, ca 250 m uppströms från Sege å","2016-06-15",15.8,9.1999999999999993,93.064237984066907,7.92,5.4,92.2,null,11,110,1800,150,2500,"ngt grumligt",{"$f":"YEAR(C519)","v":2016},{"$f":"MONTH(C519)","v":6}]
[18,"15 Risebergabäcken, ca 250 m uppströms från Sege å","2016-08-16",15.2,8.8000000000000007,87.906393375112671,8.0399999999999991,5.4,98.8,null,4.9000000000000004,93,1600,58,1700,null,2016,8]
[18,"15 Risebergabäcken, ca 250 m uppströms från Sege å","2016-10-17",10.6,10.1,91.061185003520364,7.98,3,70.599999999999994,null,4.3,86,1100,56,1500,"klart vatten",2016,10]
[18,"15 Risebergabäcken, ca 250 m uppströms från Sege å","2016-12-15",3.8,13,98.729580322845706,8.1,5.6,97.5,null,5.0999999999999996,57,4600,73,4900,null,2016,12]
[18,"15 Risebergabäcken, ca 250 m uppströms från Sege å","2017-02-21",8.1999999999999993,12.5,106.36561189379907,8.1300000000000008,7.5,124,null,4.9000000000000004,51,2600,26,3100,"grumligt",2017,2]
[18,"15 Risebergabäcken, ca 250 m uppströms från Sege å","2017-04-18",7.1,14.1,116.72547389332179,8.2200000000000006,3.7,94,null,5.0999999999999996,46,3800,17,4500,"grumligt",2017,4]
[18,"15 Risebergabäcken, ca 250 m uppströms från Sege å","2017-06-21",14.8,8.5,84.192572319481457,8.01,5.9,108,null,5.0999999999999996,92,1300,60,2400,"grumligt",2017,6]
[18,"15 Risebergabäcken, ca 250 m uppströms från Sege å","2017-08-22",16.2,8.4,85.67768068618858,7.81,3.5,71.099999999999994,null,5.8,88,1100,69,1300,null,2017,8]
[18,"15 Risebergabäcken, ca 250 m uppströms från Sege å","2017-10-17",13.5,10.199999999999999,98.228475745741378,8.1199999999999992,5.6,98.6,null,5.3,94,2700,60,3200,null,2017,10]
[18,"15 Risebergabäcken, ca 250 m uppströms från Sege å","2017-12-19",6.9,12,98.838704870357958,8.01,3.4,99,null,5.7,72,5200,75,5900,"högflöde",2017,12]
[18,"15 Risebergabäcken, ca 250 m uppströms från Sege å","2018-02-19",3.7,12.6,95.433874824456225,8.0399999999999991,6,106,null,5.3,55,4300,72,4100,null,2018,2]
[18,"15 Risebergabäcken, ca 250 m uppströms från Sege å","2018-04-16",9.9,13.9,123.26321047696187,8.1999999999999993,3.8,103,null,6.5,43,3600,33,4100,null,2018,4]
[18,"15 Risebergabäcken, ca 250 m uppströms från Sege å","2018-06-20",16.7,9.1,93.771609795427921,8.0399999999999991,9,105,null,6.5,140,650,67,1300,null,2018,6]
[18,"15 Risebergabäcken, ca 250 m uppströms från Sege å","2018-08-17",18,7.5,79.319352513529822,7.93,7,102,null,87,200,340,"<10",1300,null,2018,8]
[18,"15 Risebergabäcken, ca 250 m uppströms från Sege å","2018-10-16",12.4,9.4,88.334464520365984,8.0399999999999991,3.6,112,null,4.3,81,470,60,1000,null,2018,10]
[18,"15 Risebergabäcken, ca 250 m uppströms från Sege å","2018-12-11",7.9,10.6,89.52951526167648,7.92,3.3,87.7,null,5,54,2100,55,2500,null,2018,12]
[18,"15 Risebergabäcken, ca 250 m uppströms från Sege å","2019-02-20",6.4,12.6,102,8.17,5.3,102,null,5.8,40,8300,22,8400,null,2019,2]
[18,"15 Risebergabäcken, ca 250 m uppströms från Sege å","2019-04-16",7.3,14.1,117,8.1999999999999993,3.7,105,null,5.0999999999999996,30,3400,44,3800,null,2019,4]
[18,"15 Risebergabäcken, ca 250 m uppströms från Sege å","2019-06-18",16.2,8.6,88,7.97,4.0999999999999996,94.2,null,6.1,91,2000,59,2900,null,2019,6]
[18,"15 Risebergabäcken, ca 250 m uppströms från Sege å","2019-08-20",17.399999999999999,9,94,8,2.5,84,null,4.3,84,860,72,1000,null,2019,8]
[18,"15 Risebergabäcken, ca 250 m uppströms från Sege å","2019-10-16",12.7,9.4,89,8,3.3,83.8,null,5.3,85,1300,42,2000,null,2019,10]
[18,"15 Risebergabäcken, ca 250 m uppströms från Sege å","2019-12-11",7.2,11.2,93,8,76,55.4,null,6.8,210,2800,59,3200,null,2019,12]
[18,"15 Risebergabäcken, ca 250 m uppströms från Sege å","2020-02-12",6.5,11.8,96,7.8,19,83,null,5.6,68,5100,88,5400,null,2020,2]
[18,"15 Risebergabäcken, ca 250 m uppströms från Sege å","2020-04-20",8.1,12.2,104,8.16,2.8,100,null,5.9,58,2800,34,3100,null,2020,4]
[18,"15 Risebergabäcken, ca 250 m uppströms från Sege å","2020-06-15",15.6,9.1999999999999993,93,8.16,3.3,103,null,5.5,98,1500,84,2000,null,2020,6]
[18,"15 Risebergabäcken, ca 250 m uppströms från Sege å","2020-08-18",16.7,8.4,87,8.01,3.8,102,null,4.4000000000000004,110,1100,110,1600,null,2020,8]
[18,"15 Risebergabäcken, ca 250 m uppströms från Sege å","2020-10-19",9.4,11.1,97,8.06,2.9,95.3,null,5.0999999999999996,73,1200,45,1600,null,2020,10]
[18,"15 Risebergabäcken, ca 250 m uppströms från Sege å","2020-12-14",7.3,10.4,87,8.18,2.7,105,null,4.5,79,1800,200,2600,null,2020,12]
[20,"31 Börringesjön","2011-05-23",16.8,10.1,104.28767413773402,9.0500000000000007,29,29.1,null,33,78,"<10","<10",2800,"gulgrumligt",2011,5]
[20,"31 Börringesjön","2011-06-20",17.7,10.199999999999999,107.23743751765591,9.09,53,29.3,null,33,160,"<100","<10",3200,"gulgrumligt",2011,6]
[20,"31 Börringesjön","2011-07-25",16.100000000000001,9.1999999999999993,93.644276503266852,8.4,69,28.4,null,41,220,51,"<10",4300,null,2011,7]
[20,"31 Börringesjön","2011-08-15",17.2,10.7,111.37806183074441,8.67,47,30.2,null,37,220,"<100","<10",3600,"brungrumligt",2011,8]
[20,"31 Börringesjön","2011-09-13",16.399999999999999,9.8000000000000007,100.36858583132454,8.4,44,33.799999999999997,null,30,140,"<100","<10",3000,"mkt grumligt",2011,9]
[20,"31 Börringesjön","2012-05-15",13.3,11.2,107.384573676559,8.5500000000000007,20,40,null,21,61,280,"<10",2100,"något gulgrumligt",2012,5]
[20,"31 Börringesjön","2012-06-20",19,11.3,121.84985212642445,8.8000000000000007,30,38.4,null,20,86,"<100","<10",2200,"gulgrumligt",2012,6]
[20,"31 Börringesjön","2012-07-22",18.100000000000001,10.1,107.02668190967563,8.6,38,36.799999999999997,null,22,110,"<10","<100",2100,null,2012,7]
[20,"31 Börringesjön","2012-08-21",22.5,10,114.95542950389815,8.66,43,34.799999999999997,null,29,110,"<10","<10",2200,"gulgrumligt",2012,8]
[20,"31 Börringesjön","2012-09-17",14.7,10.8,106.74616162255202,8.48,75,36.1,null,25,180,"<10","<10",3100,"gulgrumligt",2012,9]
[20,"31 Börringesjön","2013-05-15",14.9,10.6,105.2167337140518,8.6999999999999993,40,34.4,null,21,67,"<10","<10",2100,"lågvatten, grumligt",2013,5]
[20,"31 Börringesjön","2013-06-17",17.3,9.9,103.25749511952384,8.6,49,34.4,null,23,120,"<10","<10",2700,"gulgrumligt, lågt vattenstånd",2013,6]
[20,"31 Börringesjön","2013-07-23",22.5,9,103.45988655350833,8.6999999999999993,75,33.5,null,17,160,"<10","<10",3300,null,2013,7]
[20,"31 Börringesjön","2013-08-19",20.8,12.5,139.40425178181408,9.3000000000000007,63,28.8,null,26,150,"<100","<10",3000,"gulgrumligt, mkt lågt vattenstånd",2013,8]
[20,"31 Börringesjön","2013-09-16",14.4,10,98.205548058890955,8.52,84,31.2,null,29,190,"<10","<10",4100,null,2013,9]
[20,"31 Börringesjön","2014-05-14",13,11,104.7682384448435,8.7799999999999994,37,35.6,null,19,65,"<10","<10",1900,"Gröngrumligt",2014,5]
[20,"31 Börringesjön","2014-06-12",20.100000000000001,11.3,124.40648309172798,8.75,49,35.1,null,18,31,"<10","<10",3000,"Gröngulgrumligt",2014,6]
[20,"31 Börringesjön","2014-07-17",21.5,10.8,121.97903067035188,8.42,46,34.4,null,27,130,"<100","<10",2700,"Gröngrumligt",2014,7]
[20,"31 Börringesjön","2014-08-19",15.7,10.4,104.98430964471035,8.66,74,33.6,null,27,190,"<10","<10",3900,"Gulgrumligt",2014,8]
[20,"31 Börringesjön","2014-09-17",16.2,10.7,109.1370456359783,8.61,61,33.700000000000003,null,25,190,"<10","<10",3000,"Gröngrumligt",2014,9]
[20,"31 Börringesjön","2015-05-20",13.3,12,115.05490036774179,8.6999999999999993,26,39.6,null,17,57,120,"<10",2600,"grumligt",2015,5]
[20,"31 Börringesjön","2015-06-15",17.8,10,105.34300007960471,8.59,38,37.9,null,22,83,"<10","<10",2500,"gulgrumligt",2015,6]
[20,"31 Börringesjön","2015-07-20",17.899999999999999,9.8000000000000007,103.44010945902291,8.5399999999999991,42,36.4,null,22,100,"<10","<10",2600,"gröngrumligt",2015,7]
[20,"31 Börringesjön","2015-08-17",19.399999999999999,9.4,102.13728670017066,8.6199999999999992,64,34.799999999999997,null,27,150,"<10","<10",3100,"gulgröngrumligt",2015,8]
[20,"31 Börringesjön","2015-09-16",15.2,9.5,94.898947393587534,8.6999999999999993,48,35.6,null,27,170,"<10","<10",3400,"gulgrumligt",2015,9]
[20,"31 Börringesjön","2016-05-10",16.5,11.6,119.04688343731986,8.5950000000000006,37.5,37,null,16,59,160,"<50",2400,"gulgrumligt",2016,5]
[20,"31 Börringesjön","2016-06-15",16.7,10,103.0457250499208,8.41,54,38.35,null,21,120,"<10","<50",3000,"gulgrumligt",2016,6]
[20,"31 Börringesjön","2016-07-12",19.100000000000001,9,97.234377243439013,8.69,53,34.9,null,20,140,"<10","<10",2700,null,2016,7]
[20,"31 Börringesjön","2016-08-15",17.2,10.199999999999999,106.17347950220494,8.8000000000000007,45,32.799999999999997,null,26,100,37,"<10",2500,"grulgrumligt",2016,8]
[20,"31 Börringesjön","2016-09-19",16.399999999999999,8.9,91.151062642733507,8.5500000000000007,37,33.700000000000003,null,22,78,"<10","<10",2500,"något gröngrumligt",2016,9]
[20,"31 Börringesjön","2017-05-17",14.2,11.9,116.3617109490815,8.58,35,38.4,null,20,63,130,"<10",2200,"gulgröngrumligt",2017,5]
[20,"31 Börringesjön","2017-06-20",21.4,10.3,116.12348284547475,8.52,54.5,34.950000000000003,null,21,78,"<10","<10",2600,"gulgrumligt",2017,6]
[20,"31 Börringesjön","2017-07-20",19.399999999999999,11.1,120.60892365658449,8.82,52,34.1,null,22,100,"<10","<10",2500,"gulgrumligt",2017,7]
[20,"31 Börringesjön","2017-08-21",18.899999999999999,10.4,111.93011293221895,8.7799999999999994,47,33,null,29,110,"<10","<10",2700,"grumligt",2017,8]
[20,"31 Börringesjön","2017-09-18",13.5,11.8,113.63686409801457,8.7449999999999992,40,32.75,null,23,110,"<10","<10",2600,"grumligt",2017,9]
[20,"31 Börringesjön","2018-05-16",19.899999999999999,11.8,129.42751145616418,8.67,27,35.200000000000003,null,17,47,"<10","<10",2000,"gulgrumligt",{"$f":"YEAR(C582)","v":2018},{"$f":"MONTH(C582)","v":5}]
[20,"31 Börringesjön","2018-06-20",18.2,9.4,99.804270065271012,8.3699999999999992,44,35.950000000000003,null,21,100,"<10","<10",2200,"gulgrumligt",2018,6]
[20,"31 Börringesjön","2018-07-11",20,9.1999999999999993,101.09821746709943,8.52,39,33.799999999999997,null,23,89,"<10","<10",2300,"grumligt",{"$f":"YEAR(C584)","v":2018},{"$f":"MONTH(C584)","v":7}]
[20,"31 Börringesjön","2018-08-16",20.399999999999999,10.7,118.45734323606294,8.6999999999999993,43,31.8,null,33,88,"<10","<10",2400,"gulgrumligt",2018,8]
[20,"31 Börringesjön","2018-09-19",17.100000000000001,10.3,106.99916039441177,8.75,39,31.5,null,28,89,"<10","<10",2700,"gulgrumligt",2018,9]
[20,"31 Börringesjön","2019-05-20",16.899999999999999,11.8,122,8.91,37,39.4,null,23,75,760,"<10",3100,"gröngrumligt",2019,5]
[20,"31 Börringesjön","2019-06-17",20,11.1,122,8.89,49,33.5,null,25,89,"<10","<10",2600,"gulgrumligt",2019,6]
[20,"31 Börringesjön","2019-07-10",18.3,10,106,9.0299999999999994,44,34.200000000000003,null,22,100,"<10","<10",2900,"gulgrumligt",2019,7]
[20,"31 Börringesjön","2019-08-19",17.899999999999999,9.9,104,9.01,51,34.4,null,27,93,"<10","<10",2800,"gulgrumligt",2019,8]
[20,"31 Börringesjön","2019-09-18",11.3,10.1,93,8.86,63,34.799999999999997,null,26,150,"<10","<10",3600,"gulgrumligt",2019,9]
[20,"31 Börringesjön","2020-05-18",11.2,10.5,96,8.65,43,39.4,null,27,90,"<10","<10",2500,"gulgrumligt",2020,5]
[20,"31 Börringesjön","2020-06-15",18.3,10.3,110,8.83,49,39.4,null,28,120,"<10","<10",2700,"gulgrumligt",2020,6]
[20,"31 Börringesjön","2020-07-14",17.3,11.4,119,8.7799999999999994,43,38,null,28,94,"<10","<10",2800,"gröngrumligt",2020,7]
[20,"31 Börringesjön","2020-08-17",24.2,10,118,8.64,48,36,null,30,98,"<10","<10",3200,"gulgröngrumligt",2020,8]
[20,"31 Börringesjön","2020-09-15",17.5,11,115,8.94,43,36.299999999999997,null,33,110,"<10","<10",2900,"gröngrumligt",2020,9]
[22,"32 Fjällfotasjön","2011-05-23",16.899999999999999,9.6999999999999993,100.36048359662102,8.4,27,31.2,null,27,66,"<10","<10",2200,"något gröngrumligt",2011,5]
[22,"32 Fjällfotasjön","2011-06-20",18.5,9,96.117459175394316,8.34,29,33,null,32,160,"<10","<10",2500,"gröngrumligt",2011,6]
[22,"32 Fjällfotasjön","2011-07-25",16.5,9.1,93.390227524104375,8.1,33,30.8,null,30,150,59,11,2900,null,2011,7]
[22,"32 Fjällfotasjön","2011-08-15",17.3,8.9,92.827445107450728,7.72,34,29.3,null,28,120,"<100",10,2700,"gröngrumligt",2011,8]
[22,"32 Fjällfotasjön","2011-09-13",16.7,8.6999999999999993,89.649780793431091,7.92,29,28,null,29,120,"<100",12,2600,"grumligt",2011,9]
[22,"32 Fjällfotasjön","2012-05-15",13.8,10.4,100.81467094890498,7.96,13,28.9,null,24,64,250,240,2500,"något gröngrumligt",2012,5]
[22,"32 Fjällfotasjön","2012-06-20",19,10.9,117.5365830246041,9,19,30.7,null,26,87,"<10","<10",2200,"gröngrumligt",2012,6]
[22,"32 Fjällfotasjön","2012-07-22",18.899999999999999,10.3,110.85386184633224,8.6999999999999993,30,31.3,null,29,150,11,"<10",2400,null,2012,7]
[22,"32 Fjällfotasjön","2012-08-21",22.1,9.5,108.44549732288087,8.5,35,32.9,null,38,160,"<10","<10",3000,"gröngrumligt",2012,8]
[22,"32 Fjällfotasjön","2012-09-17",14.5,10.3,101.3692708972102,8.4700000000000006,40,33.6,null,34,120,"<10",14,3300,"gröngrumligt",2012,9]
[22,"32 Fjällfotasjön","2013-05-15",15.8,10.1,102.16834822163867,8.3000000000000007,15,35.4,null,42,55,150,330,2400,"grumligt",2013,5]
[22,"32 Fjällfotasjön","2013-06-17",17.399999999999999,10.1,105.55433095691488,8.8000000000000007,38,35.9,null,33,140,"<10",19,3100,"gröngrumligt",2013,6]
[22,"32 Fjällfotasjön","2013-07-23",23.2,10.8,125.65916306305967,9.1,50,38.6,null,21,170,"<100","<10",3600,null,2013,7]
[22,"32 Fjällfotasjön","2013-08-19",19.899999999999999,10.8,118.45907828191298,9,37,37.9,null,28,110,"<10","<10",2900,"blågrönalgblomning",2013,8]
[22,"32 Fjällfotasjön","2013-09-16",16.3,9.6,98.118843552231979,9.0500000000000007,39,38.200000000000003,null,25,120,"<10","<10",3400,null,2013,9]
[22,"32 Fjällfotasjön","2014-05-14",13.1,10.6,101.18295974594704,8.5,16,32.4,null,21,78,190,"<10",2400,"Gröngrumligt",2014,5]
[22,"32 Fjällfotasjön","2014-06-12",20.6,9.4,104.44900267322686,8.73,31,34.1,null,22,42,"<10","<10",3200,"Gröngrumligt",2014,6]
[22,"32 Fjällfotasjön","2014-07-17",23,11.6,134.50597695366829,8.76,42,35.700000000000003,null,29,130,"<100","<10",3300,"Gröngrumligt",2014,7]
[22,"32 Fjällfotasjön","2014-08-19",16,9.6999999999999993,98.529869730672431,8.92,50,35.799999999999997,null,35,210,"<10",12,3900,"Gröngrumligt",2014,8]
[22,"32 Fjällfotasjön","2014-09-17",16.399999999999999,10.5,107.537770533562,9.0500000000000007,41,34.700000000000003,null,29,170,"<10",13,3300,"Gröngrumligt, ingen tydlig algblom",2014,9]
[22,"32 Fjällfotasjön","2015-05-20",14,11.4,110.99057831835815,8.56,18,28.3,null,23,82,67,"<10",2400,"grumligt",2015,5]
[22,"32 Fjällfotasjön","2015-06-15",18.3,9.6999999999999993,103.19089448347097,8.64,36,29.8,null,30,130,"<10","<10",3600,"gröngrumligt",2015,6]
[22,"32 Fjällfotasjön","2015-07-20",18.600000000000001,9.1,97.373980511521495,8.69,48,"30.9",null,35,190,"<10",14,4100,"gröngrumligt",2015,7]
[22,"32 Fjällfotasjön","2015-08-17",19.8,7.8,85.393721038224783,9,53,31.4,null,37,240,"<10","<10",4500,"extremt gröngrumligt",2015,8]
[22,"32 Fjällfotasjön","2015-09-16",15.7,9.6999999999999993,97.918058034008666,8.76,44,32.4,null,35,190,"<10","<10",4400,"gröngrumligt",2015,9]
[22,"32 Fjällfotasjön","2016-05-10",17.3,10.8,112.64454013038964,8.09,22,29,null,25,60,230,31,1600,"brungrumligt",2016,5]
[22,"32 Fjällfotasjön","2016-06-15",17.100000000000001,7.3,75.834356396039411,7.51,19,32.9,null,32,150,33,1100,3700,"gröngrumligt",2016,6]
[22,"32 Fjällfotasjön","2016-07-12",19.399999999999999,9.3000000000000007,101.0507198203816,8.81,23,30,null,25,70,57,100,3000,null,2016,7]
[22,"32 Fjällfotasjön","2016-08-15",17.399999999999999,10,104.50923857120287,8.92,22,31,null,26,88,"<10","<10",2600,"gröngrumligt",2016,8]
[22,"32 Fjällfotasjön","2016-09-19",16.3,8.8000000000000007,89.942273256212658,8.81,28,32,null,27,100,"<10","<10",3300,"gröngrumligt",2016,9]
[22,"32 Fjällfotasjön","2017-05-17",14.8,9.5,94.097580827655733,7.94,16,32.1,null,25,52,190,160,2400,"brungrumligt",2017,5]
[22,"32 Fjällfotasjön","2017-06-20",22.5,10.1,116.10498379893713,9.0299999999999994,22,32.299999999999997,null,23,68,"<10",11,2500,"beigebrumligt",2017,6]
[22,"32 Fjällfotasjön","2017-07-20",18.399999999999999,8.4,89.535465552702703,8.75,30,33.200000000000003,null,23,120,"<10","<10",2900,"gröngrumligt",2017,7]
[22,"32 Fjällfotasjön","2017-08-21",19.5,9.6,104.50803782231644,8.58,44,32.299999999999997,null,29,160,"<10","<10",4000,"grumligt",2017,8]
[22,"32 Fjällfotasjön","2017-09-18",13.8,10.5,101.78404278495215,8.2899999999999991,39,30.8,null,27,160,"<10","<10",3200,"grumligt",2017,9]
[22,"32 Fjällfotasjön","2018-05-16",19.899999999999999,9.9,108.5874884250869,8.84,12,29.6,null,26,49,"<10","<10",1900,"brungrumligt",2018,5]
[22,"32 Fjällfotasjön","2018-06-20",18.899999999999999,8.6999999999999993,93.633844472144688,8.1199999999999992,18,33.5,null,27,95,"<10","<10",2000,"ganska klart vatten",2018,6]
[22,"32 Fjällfotasjön","2018-07-11",20.6,8.3000000000000007,92.226247041253501,8.43,20,36,null,27,82,"<10","<10",2200,"något gröngrumligt",2018,7]
[22,"32 Fjällfotasjön","2018-08-16",20.2,10.199999999999999,112.50490642362278,8.7899999999999991,26,37.799999999999997,null,31,95,"<10","<10",2700,"gröngrumligt",2018,8]
[22,"32 Fjällfotasjön","2018-09-19",17.3,10.4,108.47252012556039,8.81,22,28.3,null,32,110,"<10","<10",3200,"gröngrumligt",2018,9]
[22,"32 Fjällfotasjön","2019-05-20",18,9,95,8.09,11,33.5,null,29,67,34,93,2100,"ganska klart vatten",2019,5]
[22,"32 Fjällfotasjön","2019-06-17",20.6,9.4,104,8.4,18,34.1,null,27,68,"<10","<10",1800,"brungrumligt, viss blom",2019,6]
[22,"32 Fjällfotasjön","2019-07-10",19,9.1999999999999993,99,8.7100000000000009,18,36.4,null,23,80,"<10","<10",2100,"gröngrumligt",2019,7]
[22,"32 Fjällfotasjön","2019-08-19",18.399999999999999,9.4,100,9.09,28,36.299999999999997,null,27,120,"<10","<10",2800,"gröngrumligt",2019,8]
[22,"32 Fjällfotasjön","2019-09-18",11.5,9.1,84,9.09,28,32.4,null,26,110,"<10","<10",2900,"gröngrumligt",2019,9]
[22,"32 Fjällfotasjön","2020-05-18",11.5,10.4,96,8.2100000000000009,15,31.3,null,31,83,"<10",26,2000,"ganska klart vatten",2020,5]
[22,"32 Fjällfotasjön","2020-06-15",19.2,10.8,117,9.07,16,32.5,null,32,97,"<10","<10",2300,"brungrumligt",2020,6]
[22,"32 Fjällfotasjön","2020-07-14",17.399999999999999,12.3,129,9.48,21,31.4,null,32,94,"<10","<10",2700,"gröngrumligt",2020,7]
[22,"32 Fjällfotasjön","2020-08-17",23,10.3,119,9.3699999999999992,22,30.1,null,34,97,"<10","<10",2100,"brungröngrumligt",2020,8]
[22,"32 Fjällfotasjön","2020-09-15",17,10.8,112,9.1999999999999993,19,31.2,null,37,94,"<10","<10",2700,"gröngrumligt",2020,9]
[24,"33 Yddingen","2011-05-23",17,9.8000000000000007,101.60013042047807,8.52,19,45.2,null,20,30,"<10","<10",1900,"grumligt",2011,5]
[24,"33 Yddingen","2011-06-20",18,9,95.1832230162358,8.48,21,45.9,null,22,62,"<100","<10",1800,"brungrumligt",{"$f":"YEAR(C648)","v":2011},{"$f":"MONTH(C648)","v":6}]
[24,"33 Yddingen","2011-07-25",16.600000000000001,9.1,93.58096438431744,8.39,19,43.4,null,20,62,56,10,1800,null,2011,7]
[24,"33 Yddingen","2011-08-15",17.5,9,94.246073868310233,8.2799999999999994,14,43.7,null,20,72,"<10","<10",1900,"brungrumligt",2011,8]
[24,"33 Yddingen","2011-09-13",16.8,9,92.929610617782771,8.4,15,45.65,null,20,53,"<10","<10",1700,"grumligt",2011,9]
[24,"33 Yddingen","2012-05-15",13.4,11.1,106.66075605988578,8.4600000000000009,20,48.5,null,22,47,"<10","<10",1500,"brungrumligt",2012,5]
[24,"33 Yddingen","2012-06-20",18.7,9.3000000000000007,99.706629823875019,8.4,18,47.9,null,18,52,"<10","<10",1600,"brungrumligt",2012,6]
[24,"33 Yddingen","2012-07-22",18.5,10.1,107.86514863016473,8.5,26,45.5,null,20,69,11,10,1700,null,2012,7]
[24,"33 Yddingen","2012-08-21",22.5,9.3000000000000007,106.90854943862529,8.4600000000000009,23,43,null,25,62,"<10","<10",1800,"gulgrumligt",2012,8]
[24,"33 Yddingen","2012-09-17",15.2,9.6999999999999993,96.896819970294629,8.4600000000000009,23,43.7,null,18,75,29,"<10",2100,"gulgrumligt",2012,9]
[24,"33 Yddingen","2013-05-15",15.3,10.6,106.1106039914562,8.5,20,46.3,null,17,42,"<10","<10",1800,"grumligt",2013,5]
[24,"33 Yddingen","2013-06-17",18.2,9.9,105.1130078347003,8.4,23,44.1,null,20,48,"<10","<10",1700,"gulgrumligt",2013,6]
[24,"33 Yddingen","2013-07-23",23.8,10.1,118.71391522517467,8.5,26,43,null,15,54,"<10","<10",1900,null,2013,7]
[24,"33 Yddingen","2013-08-19",20.5,10.8,119.78492558297718,8.6,15,41.3,null,20,50,"<10","<10",1700,"gulgrumligt",2013,8]
[24,"33 Yddingen","2013-09-16",15.9,8.9,90.216652870116505,8.39,14,42.2,null,18,53,"<10","<10",1800,null,2013,9]
[24,"33 Yddingen","2014-05-14",13,10,95.24385313167592,8.4700000000000006,17,45,null,19,54,"<10","<10",1900,"Brungrumligt",2014,5]
[24,"33 Yddingen","2014-06-12",20.6,9.3000000000000007,103.33784307032019,8.5399999999999991,19,45.8,null,17,38,"<10","<10",1700,"Gulgrumligt",2014,6]
[24,"33 Yddingen","2014-07-17",21.3,9.9,111.41336134545713,8.4,15,45.9,null,21,46,"<100","<10",1800,"Brungrumligt",2014,7]
[24,"33 Yddingen","2014-08-19",16.5,9.8000000000000007,100.57409117980471,8.51,24,43.4,null,19,21,"<10","<10",1900,"Gröngrumligt",2014,8]
[24,"33 Yddingen","2014-09-17",16.899999999999999,9.6,99.325839435831114,8.32,17,43.6,null,18,59,"<10","<10",700,"Brungrumligt",2014,9]
[24,"33 Yddingen","2015-05-20",13.5,10.6,102.08057283380967,8.7100000000000009,19,44.8,null,18,51,"<10","<10",2000,"grumligt",2015,5]
[24,"33 Yddingen","2015-06-15",17.899999999999999,9.1,96.051530211949839,8.4600000000000009,23,45.2,null,25,48,"<10","<10",2000,"gulgrumligt",2015,6]
[24,"33 Yddingen","2015-07-20",18.7,8.5,91.129715430423403,8.3699999999999992,23,45.2,null,26,58,"<10","<10",2100,"brungrumligt",2015,7]
[24,"33 Yddingen","2015-08-17",19.8,8.4,91.962468810395919,8.41,23,43.5,null,20,60,"<10","<10",2200,"brungrumligt",2015,8]
[24,"33 Yddingen","2015-09-16",15.6,9.8000000000000007,98.721320495697071,8.5,19,42.8,null,19,78,"<10","<10",2400,"brungrumligt",2015,9]
[24,"33 Yddingen","2016-05-10",16.600000000000001,12.5,128.54528074768879,8.59,25,15.6,null,16,36,"<10","<50",1800,"brungrumligt",2016,5]
[24,"33 Yddingen","2016-06-15",17.3,9.1,94.913455109865339,8.3800000000000008,18,45.3,null,16,33,"<10","<10",1800,"brungrumligt",2016,6]
[24,"33 Yddingen","2016-07-12",19.399999999999999,8.8000000000000007,95.61788542143637,8.58,19,42.8,null,16,52,"<10","<10",1800,null,2016,7]
[24,"33 Yddingen","2016-08-15",17.3,9.5,99.085475114694589,8.4600000000000009,19,43,null,18,46,"<10","<10",1600,"brungrumligt",2016,8]
[24,"33 Yddingen","2016-09-19",17.3,8.1199999999999992,84.692006098033673,8.33,17,42.7,null,18,54,"<10","<10",2000,"brungrumligt",2016,9]
[24,"33 Yddingen","2017-05-17",14.5,10.4,102.35343857582389,8.42,20,47.5,null,19,27,"<10","<10",1600,"brungrumligt",2017,5]
[24,"33 Yddingen","2017-06-20",22.1,10.5,119.86081283055255,8.57,21,45.4,null,18,30,"<10","<10",1600,"gulgrumligt",2017,6]
[24,"33 Yddingen","2017-07-20",19,8.8000000000000007,94.891920240047355,8.43,21,44.6,null,18,53,"<10","<10",1800,"gulgrumligt",2017,7]
[24,"33 Yddingen","2017-08-21",19.600000000000001,9.1,99.252090598913455,8.56,23,42.9,null,21,60,"<10","<10",2100,"grumligt",2017,8]
[24,"33 Yddingen","2017-09-18",13.8,10.199999999999999,98.875927276810643,8.42,15,42.3,null,17,56,"<10","<10",1700,"grumligt",2017,9]
[24,"33 Yddingen","2018-05-16",19,11.1,119.69321757551425,8.4499999999999993,21,46.3,null,18,43,"<10","<10",1800,"brungrumligt",2018,5]
[24,"33 Yddingen","2018-06-20",19.100000000000001,8.6,92.912849365952823,8.24,32,45.3,null,21,82,"<10","<10",1800,"gulgrumligt",2018,6]
[24,"33 Yddingen","2018-07-11",21,7.4,82.828278345311446,8.2100000000000009,31,45.7,null,20,89,"<10","<10",2200,"brungrumligt",2018,7]
[24,"33 Yddingen","2018-08-16",20.3,9.6999999999999993,107.18834652952962,8.43,23,42.9,null,23,62,"<10","<10",2100,"brungrumligt",2018,8]
[24,"33 Yddingen","2018-09-19",17,9.9,102.63686644517679,8.39,25,43.2,null,25,79,"<10","<10",2500,"brungrumligt",2018,9]
[24,"33 Yddingen","2019-05-20",17.100000000000001,12.4,129,9.06,34,40.700000000000003,null,27,71,"<10","<10",2800,"brungrumligt",2019,5]
[24,"33 Yddingen","2019-06-17",21,9.1,102,8.34,19,41.4,null,25,70,"<10","<10",2400,"brungrumligt",2019,6]
[24,"33 Yddingen","2019-07-10",18.5,9.4,100,8.6300000000000008,24,43.6,null,19,79,"<10","<10",2400,"brungrumligt",2019,7]
[24,"33 Yddingen","2019-08-19",18.3,8.8000000000000007,94,8.48,16,45.8,null,24,52,"<10","<10",2000,"brungrumligt",2019,8]
[24,"33 Yddingen","2019-09-18",12.5,9.9,93,8.6,29,45.4,null,18,64,"<10","<10",2300,"brungrumligt",2019,9]
[24,"33 Yddingen","2020-05-18",11.5,10,92,8.6300000000000008,16,48.8,null,25,59,"<10",12,2000,"brungrumligt",2020,5]
[24,"33 Yddingen","2020-06-15",18.7,10.1,108,8.68,15,49.8,null,25,60,"<10","<10",1900,"brungrumligt",2020,6]
[24,"33 Yddingen","2020-07-14",16.899999999999999,10.4,108,8.52,17,50,null,23,68,"<10","<10",2200,"brungrumligt",2020,7]
[24,"33 Yddingen","2020-08-17",24.2,9.9,117,8.51,25,49.5,null,22,55,"<10","<10",2300,"mkt gulgrumligt",2020,8]
[24,"33 Yddingen","2020-09-15",16.3,10.6,108,8.8800000000000008,14,50,null,23,53,"<10","<10",2100,"gröngrumligt",2020,9]
[26,"34 Havgårdssjön","2011-05-23",16.8,9.3000000000000007,96.027264305042209,8.2200000000000006,4.9000000000000004,28.8,null,9.4,34,"<100",48,900,"klart vatten",2011,5]
[26,"34 Havgårdssjön","2011-06-20",18.8,8.5,91.305590742372573,8.23,12,28.6,null,12,43,"<10",12,1100,"ganska klart",2011,6]
[26,"34 Havgårdssjön","2011-07-25",17.600000000000001,8,83.941089523505156,8.14,13,26.8,null,9.4,59,19,110,1100,null,2011,7]
[26,"34 Havgårdssjön","2011-08-15",17.899999999999999,9.1,96.051530211949839,8.34,12,25.9,null,14,63,17,18,1100,"gröngrumligt",2011,8]
[26,"34 Havgårdssjön","2011-09-13",16.399999999999999,9,92.175231885910293,8.2899999999999991,9,26.7,null,9.1,44,"<10",10,1000,"grumligt",2011,9]
[26,"34 Havgårdssjön","2012-05-15",13.6,10,96.514049381407602,8.1999999999999993,5.6,31.1,null,9,37,370,57,1200,"grönt och klart vatten",2012,5]
[26,"34 Havgårdssjön","2012-06-20",18.7,10.8,115.78834431159679,8.6,10,29.5,null,9.9,44,"<10","<10",1100,"ngt gröngrumligt",2012,6]
[26,"34 Havgårdssjön","2012-07-22",18.600000000000001,11.9,127.33520528429733,8.5,15,28.6,null,11,63,15,"<100",1200,null,2012,7]
[26,"34 Havgårdssjön","2012-08-21",22.1,10.7,122.14387593208687,8.7100000000000009,14,24.3,null,11,88,"<10",26,1400,"gröngrumligt",2012,8]
[26,"34 Havgårdssjön","2012-09-17",15.3,9.1999999999999993,92.09599591711293,8.27,9.3000000000000007,26.5,null,12,56,"<10",35,1100,"något grumligt",2012,9]
[26,"34 Havgårdssjön","2013-05-15",15.7,10.8,109.02216770796844,8.6,7.9,25.8,null,9.4,47,"<10","<10",1100,"grumligt",2013,5]
[26,"34 Havgårdssjön","2013-06-17",18.3,9.1,96.807952556658321,8.3000000000000007,13,27.2,null,9.5,43,"<10","<10",1000,"gröngrumligt",2013,6]
[26,"34 Havgårdssjön","2013-07-23",22.2,10,114.35403968655251,8.6,8.6999999999999993,27,null,11,53,"<10","<10",1100,null,2013,7]
[26,"34 Havgårdssjön","2013-08-19",20.8,11.6,129.36714565352347,8.8000000000000007,8.5,25.7,null,12,51,"<10","<10",1100,"ganska klart vatten",2013,8]
[26,"34 Havgårdssjön","2013-09-16",16.8,8.5,87.766854472350403,8.18,10,26.6,null,9.1,49,"<10","<10",1200,"klart vatten",2013,9]
[26,"34 Havgårdssjön","2014-05-14",13.5,8.6999999999999993,83.783111665485293,8.0500000000000007,8.9,30.6,null,9.3000000000000007,38,620,180,1600,"Ganska klart",{"$f":"YEAR(C712)","v":2014},{"$f":"MONTH(C712)","v":5}]
[26,"34 Havgårdssjön","2014-06-12",20.3,11.8,130.39407103592268,8.73,7.9,29.4,null,8.1999999999999993,35,120,68,1600,"Ngt gröngrumligt",2014,6]
[26,"34 Havgårdssjön","2014-07-17",21.8,9.1,103.32982829293054,8.18,5.7,29.5,null,9.6,42,"<10","<10",960,"Klart vatten",2014,7]
[26,"34 Havgårdssjön","2014-08-19",17.5,9,94.246073868310233,8.4600000000000009,15,29,null,13,73,"<10",92,1300,"Viss algblomning",2014,8]
[26,"34 Havgårdssjön","2014-09-17",16.7,9.5,97.893438797424764,8.1999999999999993,5.8,28.9,null,10,47,27,73,1000,"Gröngrumligt",2014,9]
[26,"34 Havgårdssjön","2015-05-20",13.5,10.6,102.08057283380967,8.27,4.7,30.4,null,7.3,31,210,72,1500,"klart vatten",2015,5]
[26,"34 Havgårdssjön","2015-06-15",18.100000000000001,9.6,101.72833132008773,8.31,9.1,30.5,null,9.1999999999999993,39,330,77,1500,"något grumligt",2015,6]
[26,"34 Havgårdssjön","2015-07-20",19.100000000000001,8.5,91.832467396581279,8.18,7.9,27.2,null,9,44,"<10",12,1100,"gröngrumligt",2015,7]
[26,"34 Havgårdssjön","2015-08-17",20.399999999999999,9,99.637017675193135,8.31,6.5,27.4,null,9.1,49,"<10",21,1100,"något grönt vatten",2015,8]
[26,"34 Havgårdssjön","2015-09-16",15.8,9.4,95.087373592416185,8.3800000000000008,4.9000000000000004,27.4,null,10,44,"<10",15,1200,"ganska klart vatten",2015,9]
[26,"34 Havgårdssjön","2016-05-10",15.9,9.4,95.285004154954507,8.19,4.5999999999999996,29.9,null,7.7,33,300,56,1200,"klart vatten",2016,5]
[26,"34 Havgårdssjön","2016-06-15",18.2,9.4,99.804270065271012,8.4499999999999993,5.7,28.9,null,8.6,39,12,52,1100,"rel klart",2016,6]
[26,"34 Havgårdssjön","2016-07-12",19.600000000000001,9.1,99.252090598913455,8.5299999999999994,6.1,27.4,null,8.1999999999999993,45,"<10",17,990,null,2016,7]
[26,"34 Havgårdssjön","2016-08-15",17.899999999999999,9.1999999999999993,97.107041532960267,8.4,5.0999999999999996,26.5,null,8.6999999999999993,37,"<10","<10",970,"ganska klart vatten",2016,8]
[26,"34 Havgårdssjön","2016-09-19",17.899999999999999,7.9,83.385394359824588,8.1199999999999992,6.7,27.2,null,8.1999999999999993,37,"<10",76,1200,"något gröngrumligt",2016,9]
[26,"34 Havgårdssjön","2017-05-17",13.9,11,106.86356040736274,8.3000000000000007,3.75,30.75,null,8.6999999999999993,33,380,84,1100,"klart vatten",2017,5]
[26,"34 Havgårdssjön","2017-06-20",20.399999999999999,10.8,119.56442121023176,8.6199999999999992,4.5,29.3,null,9.3000000000000007,32,27,23,1000,"klart vatten",2017,6]
[26,"34 Havgårdssjön","2017-07-20",19.399999999999999,8.9,96.704452301225402,8.32,5.4,29.3,null,8.8000000000000007,43,"<10","<10",1100,"klart vatten",2017,7]
[26,"34 Havgårdssjön","2017-08-21",19.2,8.1,87.678056976965266,8.14,3,29.1,null,9.1,43,12,22,970,"klart vatten ",2017,8]
[26,"34 Havgårdssjön","2017-09-18",14.6,10,98.627932077471058,8.18,5,28.6,null,8.8000000000000007,37,110,43,1000,"relativt klart ",2017,9]
[26,"34 Havgårdssjön","2018-05-16",20.100000000000001,10.8,118.90177145050107,8.27,2.2999999999999998,32.1,null,7.7,24,270,28,1100,"klart vatten",2018,5]
[26,"34 Havgårdssjön","2018-06-20",19.8,8.8000000000000007,96.341633991843338,8.26,7.2,29.7,null,9.3000000000000007,61,"<10","<10",910,"klart vatten",2018,6]
[26,"34 Havgårdssjön","2018-07-11",20.9,10.5,117.3131889978567,8.6150000000000002,12,29.5,null,9.3000000000000007,52,"<10","<10",1100,"gröngrumligt",2018,7]
[26,"34 Havgårdssjön","2018-08-16",21.1,10.4,116.61850428492535,8.5,8.8000000000000007,26.5,null,10,55,"<10","<10",1200,"gröngrumligt",2018,8]
[26,"34 Havgårdssjön","2018-09-19",17.5,9.5,99.481966860994135,8.2100000000000009,7.9,27.8,null,10,49,"<10",16,1200,"ganska klart vatten",2018,9]
[26,"34 Havgårdssjön","2019-05-20",16.899999999999999,10.199999999999999,106,8.3000000000000007,2.1,31,null,8.8000000000000007,27,770,59,1600,"klart vatten",2019,5]
[26,"34 Havgårdssjön","2019-06-17",20.399999999999999,8,89,8.0500000000000007,5.6,31.1,null,9.4,46,430,150,1500,"ganska klart",2019,6]
[26,"34 Havgårdssjön","2019-07-10",18.3,9.6,102,8.68,11,29,null,9.6999999999999993,71,"<10","<10",1200,"gröngrumligt",2019,7]
[26,"34 Havgårdssjön","2019-08-19",19.399999999999999,9.9,108,8.91,6.2,26,null,9,60,"<10","<10",1200,"något gröngrumligt",2019,8]
[26,"34 Havgårdssjön","2019-09-18",13.2,9.9,95,8.1999999999999993,4.5,26.4,null,9.3000000000000007,40,92,44,1100,"klart vatten",2019,9]
[26,"34 Havgårdssjön","2020-05-18",11.8,9.8000000000000007,91,8.26,4.9000000000000004,32.200000000000003,null,9.8000000000000007,43,840,58,1600,"ganska klart vatten",2020,5]
[26,"34 Havgårdssjön","2020-06-15",19.2,9.6999999999999993,105,8.5500000000000007,4,31.2,null,9.6,40,500,47,1300,"klart vatten",2020,6]
[26,"34 Havgårdssjön","2020-07-14",17.5,9.9,104,8.36,4.8,27.6,null,9.8000000000000007,48,"<10","<10",1000,"klart vatten",2020,7]
[26,"34 Havgårdssjön","2020-08-17",23.8,10.1,119,8.5,8.8000000000000007,27.8,null,8.8000000000000007,44,"<10","<10",1200,"gröngrumligt",2020,8]
[26,"34 Havgårdssjön","2020-09-15",17.100000000000001,10.7,111,8.5399999999999991,4.3,28.6,null,9.1999999999999993,39,"<10","<10",950,"något gröngrumligt",2020,9]
[28,"35 Eksholmssjön","2011-08-15",17.5,7,73.302501897574629,5.84,1.8,87.3,null,38,68,"<100",23,1400,"mkt humöst",2011,8]
[28,"35 Eksholmssjön","2012-08-21",24,9.5,112.03584921950988,6.02,1.24,10,null,39,100,14,120,1500,"brunt vatten",2012,8]
[28,"35 Eksholmssjön","2013-08-19",21.7,8.5,96.345423372380239,6.3,2.2000000000000002,9.5,null,36,52,"<100","<10",1100,"ingen algblomning",2013,8]
[28,"35 Eksholmssjön","2014-08-19",17.100000000000001,7.9,82.067317195713898,6.85,3.2,10.199999999999999,null,28,74,"<10",43,1200,"Brunfärgat",2014,8]
[28,"35 Eksholmssjön","2015-08-17",19.600000000000001,7.2,78.529126627711747,5.9,1.1000000000000001,10.7,null,29,56,"<10",140,1300,"brunfärgat vatten",2015,8]
[28,"35 Eksholmssjön","2016-08-15",17.8,7.5,79.007250059703537,6.29,1.5,10.199999999999999,null,29,60,14,77,1200,"humöst, brunt",2016,8]
[28,"35 Eksholmssjön","2017-08-21",20.5,8.6,95.38429259385218,6.37,1.9750000000000001,9.4,null,24,66,"<10","<10",970,"humöst vatten",2017,8]
[28,"35 Eksholmssjön","2018-08-16",20.8,8.6999999999999993,97.025359240142592,7.18,4,10.8,null,38,67,"<10","<10",1400,"mycket humöst",2018,8]
[28,"35 Eksholmssjön","2019-08-19",18.7,6.6,71,6.44,2.1,11.2,null,26,40,"<10",37,1000,"humöst",2019,8]
[28,"35 Eksholmssjön","2020-08-17",23,7.7,89,6.86,2.1,12.2,null,26,46,"<10",22,1100,"humöst vatten",2020,8]
[30,"A1 Alnarpsån, mynningen","2018-02-19",3,12.1,89.919339771862411,7.89,5.6,98.9,null,5.0999999999999996,110,8300,100,7400,"Ny lokal",2018,2]
[30,"A1 Alnarpsån, mynningen","2018-04-16",10.3,20.3,181.73502565407671,8.2799999999999994,3.9,100,null,6.6,79,5400,"<10",6100,"grumligt",2018,4]
[30,"A1 Alnarpsån, mynningen","2018-06-20",18.100000000000001,9.1,96.429980730499835,7.82,11,119,null,9.1999999999999993,250,1100,230,1600,"grumligt",2018,6]
[30,"A1 Alnarpsån, mynningen","2018-08-17",20.2,12.8,141.18262766885999,7.89,4.9000000000000004,83.7,null,9.6999999999999993,160,1200,98,2300,"stillastående",2018,8]
[30,"A1 Alnarpsån, mynningen","2018-10-16",11.5,5.3,48.794875308854536,7.76,6.9,109,null,5.2,95,1700,56,2000,"nästan stillastående",2018,10]
[30,"A1 Alnarpsån, mynningen","2018-12-11",5.2,9.6,75.675063796466873,7.73,4.5,81.900000000000006,null,5.4,69,2600,140,3100,"klart vatten",2018,12]
[30,"A1 Alnarpsån, mynningen","2019-02-20",6.7,14.5,119,8.09,2.8,96.5,null,5.3,58,18000,21,17000,null,2019,2]
[30,"A1 Alnarpsån, mynningen","2019-04-16",6.4,15.1,123,8.0399999999999991,3.2,101,null,5.5,39,6300,26,6600,"klart vatten",2019,4]
[30,"A1 Alnarpsån, mynningen","2019-06-18",18.2,6,64,7.67,12,81.400000000000006,null,6.5,140,2900,220,3100,null,2019,6]
[30,"A1 Alnarpsån, mynningen","2019-08-20",17.7,4.8,50,7.56,4.2,56.6,null,4.8,150,1200,55,1500,null,2019,8]
[30,"A1 Alnarpsån, mynningen","2019-10-16",12.4,7.1,67,7.69,5.4,79,null,5.5,91,6100,67,6700,null,2019,10]
[30,"A1 Alnarpsån, mynningen","2019-12-11",6.8,10.9,90,7.93,47,60.9,null,5.4,120,7100,73,8400,null,2019,12]
[30,"A1 Alnarpsån, mynningen","2020-02-12",5.4,11.5,91,7.83,13,75.599999999999994,null,5.8,120,11000,39,11000,null,2020,2]
[30,"A1 Alnarpsån, mynningen","2020-04-20",6.1,9,73,7.81,3.7,98.3,null,6.3,68,4300,36,4400,null,2020,4]
[30,"A1 Alnarpsån, mynningen","2020-06-15",19.399999999999999,14.5,158,8.35,7.4,88.2,null,7.7,190,1100,78,1900,null,2020,6]
[30,"A1 Alnarpsån, mynningen","2020-08-18",18.2,3.4,36,8.07,3.7,100,null,5.3,170,1200,130,1900,"klart vatten",2020,8]
[30,"A1 Alnarpsån, mynningen","2020-10-19",8.4,7.3,62,7.71,6.7,83.1,null,6.7,79,1100,62,1600,null,2020,10]
[30,"A1 Alnarpsån, mynningen","2020-12-14",5.7,8.8000000000000007,70,7.84,4.2,120,null,4.9000000000000004,64,1500,68,2000,null,2020,12]
[32,"A4 Alnarpsån, Coyetgården","2018-02-19",3.1,12.8,95.38164738679265,7.88,2.8,86.5,null,2.9,160,9300,11,8400,"Ny lokal",{"$f":"YEAR(C775)","v":2018},{"$f":"MONTH(C775)","v":2}]
[32,"A4 Alnarpsån, Coyetgården","2018-04-16",9.5,16.600000000000001,145.80313953761529,8.24,2.2999999999999998,89.3,null,3.9,250,6000,670,6900,"klart vatten",2018,4]
[32,"A4 Alnarpsån, Coyetgården","2018-06-20",17.100000000000001,9,93.494411995117076,7.87,2.2000000000000002,78.5,null,4,160,770,56,880,"klart vatten",2018,6]
[32,"A4 Alnarpsån, Coyetgården","2018-08-17",17.399999999999999,6.8,71.066282228417947,7.74,3.4,71,null,4,140,650,45,770,"stillastående",2018,8]
[32,"A4 Alnarpsån, Coyetgården","2018-10-16",9.8000000000000007,9.1999999999999993,81.389784893885093,7.93,2,75.7,null,2.7,120,980,29,980,"klart vatten",2018,10]
[32,"A4 Alnarpsån, Coyetgården","2018-12-11",6.1,11.5,92.80083480256333,7.91,4,71.400000000000006,null,3.2,81,3000,26,3300,"klart vatten",2018,12]
[32,"A4 Alnarpsån, Coyetgården","2019-02-20",6.4,12.2,99,8.02,2.7,88.9,null,3.2,210,21000,54,21000,null,2019,2]
[32,"A4 Alnarpsån, Coyetgården","2019-04-16",6.4,17.8,145,8.3800000000000008,1.6,88.4,null,2.9,86,6800,"<10",7300,"klart vatten",2019,4]
[32,"A4 Alnarpsån, Coyetgården","2019-06-18",17.3,7.6,79,7.77,6.9,71.900000000000006,null,4.4000000000000004,94,5100,76,4500,null,2019,6]
[32,"A4 Alnarpsån, Coyetgården","2019-08-20",17,7,73,7.91,5,70.400000000000006,null,3.4,120,690,53,820,null,2019,8]
[32,"A4 Alnarpsån, Coyetgården","2019-10-16",12.8,9,85,7.9,6.2,76.5,null,3.7,93,4000,40,5000,null,2019,10]
[32,"A4 Alnarpsån, Coyetgården","2019-12-11",7.3,11.1,92,7.87,39,44.7,null,4.0999999999999996,120,6600,110,7000,null,2019,12]
[32,"A4 Alnarpsån, Coyetgården","2020-02-12",6,11.8,95,7.87,8,75.8,null,3.6,140,13000,56,14000,null,2020,2]
[32,"A4 Alnarpsån, Coyetgården","2020-04-20",5.5,12,95,8.0299999999999994,2.6,90.1,null,3.5,160,3900,32,4400,null,2020,4]
[32,"A4 Alnarpsån, Coyetgården","2020-06-15",20.399999999999999,14.8,164,8.4499999999999993,3.8,85.5,null,4.3,130,1500,200,1900,null,2020,6]
[32,"A4 Alnarpsån, Coyetgården","2020-08-18",17.100000000000001,9.9,103,8.07,1.8,89.6,null,3.2,11,180,"<10",410,"klart vatten",2020,8]
[32,"A4 Alnarpsån, Coyetgården","2020-10-19",7.1,11.1,92,8.1,3,68.400000000000006,null,2.8,41,700,34,930,"grumligt",2020,10]
[32,"A4 Alnarpsån, Coyetgården","2020-12-14",5,11.7,92,8.25,2.7,88.4,null,2.4,63,1500,53,1900,null,2020,12]

{"sheet":"Rapport","index":9,"n_rows":113,"n_cols":21,"rows_kept":113,"cut":false,"hidden":false,"merged":[]}
[null,"Sege å\nRapport"]
[null,"Metoder och mätosäkerhet"]
[null,"Sege å 2021"]
[null,"Vattenkontroll "]
[null,"På uppdrag av Segeåns Vattendragsförbund "]
[null,"och Vattenråd"]
["Sorterings-","Provtagningspunkt","Provtagn"," Vattenf"," Temp"," Syreh","Syrem","  pH","Gruml","  Kond","BOD7","TOC","Tot-P"," NO3+2-N","NH4-N"," Tot-N","Klor a","Siktdj VK","Siktdj","   Tid","Anmärkning"]
["ordning","Nr Läge","datum","    m3/s","  °C","mg/l","%",null,"  FNU","mS/m","mg/l","mg/l"," µg/l","  µg/l","  µg/l","  µg/l","mg/m3","m","m"]
[250,"februari"]
[3,"1  Sege å, vid Brännemölla, uppströms Svedala AR","2021-02-15",null,0.4,14,{"$f":"IF(F10<>\"\",ROUND((F10/((9.266*EXP(-0.04555*E10)+5.374))*100),0),\"\")","v":97},7.78,12,50.4,4.9000000000000004,22,65,1800,250,3600,null,null,null,1545,"is i kanten "]
[5,"2  Sege å, söder Krågeholm, nedströms Svedala AR","2021-02-15",0.49,1.2,13.5,{"$f":"IF(F11<>\"\",ROUND((F11/((9.266*EXP(-0.04555*E11)+5.374))*100),0),\"\")","v":95},7.8,15,54.2,5,19,86,2900,300,4100,null,null,null,1600,"is i kanten "]
[7,"9  Sege å, vid Lilla Mölleberga","2021-02-15",null,0,14,96,7.92,11,68.3,null,16,83,3300,300,3900,null,null,null,1445,"istäckt"]
[9,"18 Sege å, nordväst Valdemarsro, järnvägsbron","2021-02-15",null,0.1,13.5,92,7.89,14,78.2,null,14,99,4300,240,4800,null,null,null,1400,"is i kanten "]
[11,"21 Spångholmsbäcken, vid utlopp till Sege å","2021-02-15",null,0,13.5,92,7.9,11,68.7,null,16,72,1500,640,3100,null,null,null,1500,"istäckt"]
[13,"22b Spångholmsbäcken, bron vid Torupsvägen","2021-02-15",null,0.1,13.8,95,7.91,6.6,62.9,null,18,55,1400,910,3000,null,null,null,1510,"is i kanten "]
[15,"23 Spångholmsbäcken, uppströms Torupsdammen","2021-02-15",null,0,14.3,98,8.01,10,59,null,18,62,760,980,3000,null,null,null,1520,"istäckt"]
[17,"10 Torrebergabäcken, vägbron nordost Mölleberga","2021-02-15",null,0,11.5,79,7.67,9.6,78.900000000000006,null,12,140,6900,210,6700,null,null,null,1430,"istäckt"]
[18,"15 Risebergabäcken, ca 250 m uppströms från Sege å","2021-02-15",null,0.9,14.5,102,8.24,2.6,115,null,5.2,31,1600,37,3600,null,null,null,1410]
[30,"A1 Alnarpsån, mynningen","2021-02-15",null,0.1,13.3,91,7.92,18,113,null,5.6,63,5700,160,5800,null,null,null,1315,"istäckt"]
[32,"A4 Alnarpsån, Coyetgården","2021-02-15",null,0.1,18.5,127,8.36,8,88.1,null,3.4,130,6100,300,6300,null,null,null,1330,"istäckt"]
[200,"provtagningsuppgifter",null,"Provtagning:Jan Pröjts     Analysansvarig Ekologigruppen:Jan Pröjts   Analysansvarig Synlab: Mats Lindgren"]
[250,"april"]
[3,"1  Sege å, vid Brännemölla, uppströms Svedala AR","2021-04-19",null,9.8000000000000007,11.2,{"$f":"IF(F23<>\"\",ROUND((F23/((9.266*EXP(-0.04555*E23)+5.374))*100),0),\"\")","v":99},7.81,11,47.7,6.3,22,66,1300,"<10",2900,null,null,null,1050,"grumligt "]
[5,"2  Sege å, söder Krågeholm, nedströms Svedala AR","2021-04-19",0.41,9.5,12,105,7.89,11,56.8,6.1,18,69,2100,68,3400,null,null,null,1030,"grumligt "]
[7,"9  Sege å, vid Lilla Mölleberga","2021-04-19",null,9.5,11,97,8,8.1999999999999993,63.8,null,15,77,2100,"<10",2900,null,null,null,920]
[9,"18 Sege å, nordväst Valdemarsro, järnvägsbron","2021-04-19",null,9.5,10.4,91,8,6.7,70.099999999999994,null,13,62,2400,14,3200,null,null,null,840]
[11,"21 Spångholmsbäcken, vid utlopp till Sege å","2021-04-19",null,8.6,11,95,7.85,7,63.9,null,15,60,1200,50,2100,null,null,null,930]
[13,"22b Spångholmsbäcken, bron vid Torupsvägen","2021-04-19",null,9.1,11.5,100,7.83,4.3,58.8,null,18,52,1200,180,2300,null,null,null,950]
[15,"23 Spångholmsbäcken, uppströms Torupsdammen","2021-04-19",null,9.4,11.1,97,7.99,3.1,56.4,null,18,53,590,410,2100,null,null,null,1010]
[17,"10 Torrebergabäcken, vägbron nordost Mölleberga","2021-04-19",null,8.9,9.8000000000000007,85,7.84,5.3,66,null,14,66,2900,20,3600,null,null,null,910]
[18,"15 Risebergabäcken, ca 250 m uppströms från Sege å","2021-04-19",null,9.5,12.2,107,8.06,3.2,104,null,5.5,32,2000,37,2300,null,null,null,850]
[30,"A1 Alnarpsån, mynningen","2021-04-19",null,6.6,18.5,151,7.73,5.4,100,null,6,52,3400,26,3900,null,null,null,800]
[32,"A4 Alnarpsån, Coyetgården","2021-04-19",null,8.6,8.6,74,8.17,1.4,86.1,null,3.2,16,3800,"<10",4400,null,null,null,815]
[200,"provtagningsuppgifter",null,"Provtagning:Jan Pröjts     Analysansvarig Ekologigruppen:Jan Pröjts   Analysansvarig SGS: Mats Lindgren"]
[250,"maj"]
[20,"31 Börringesjön","2021-05-17",null,16.3,13.3,{"$f":"IF(F36<>\"\",ROUND((F36/((9.266*EXP(-0.04555*E36)+5.374))*100),0),\"\")","v":136},8.82,36,38.6,null,20,77,"<10","<10",2300,62,0.3,0.3,1000,"gröngrumligt"]
[22,"32 Fjällfotasjön","2021-05-17",null,16.399999999999999,10.6,109,8.8699999999999992,8.9,31.4,null,25,52,"<10","<10",1900,28,0.6,0.6,930,"brungrumligt"]
[24,"33 Yddingen","2021-05-17",null,16.100000000000001,13.4,136,8.75,14,49.5,null,21,40,"<10","<10",2000,90,0.55000000000000004,0.5,800,"gulgrumligt"]
[26,"34 Havgårdssjön","2021-05-17",null,16.100000000000001,9.3000000000000007,95,8.31,3.7,30.8,null,7.6,42,180,39,1000,4.2,2,1.8,1030,"ganska klart vatten"]
[200,"provtagningsuppgifter",null,"Provtagning:Jan Pröjts     Analysansvarig Ekologigruppen:Jan Pröjts   Analysansvarig SGS: Mats Lindgren"]
[250,"juni"]
[3,"1  Sege å, vid Brännemölla, uppströms Svedala AR","2021-06-15",null,16.399999999999999,4.3,{"$f":"IF(F42<>\"\",ROUND((F42/((9.266*EXP(-0.04555*E42)+5.374))*100),0),\"\")","v":44},7.41,18,45.3,7.7,26,160,590,250,3300,null,null,null,1000,"grumligt"]
[5,"2  Sege å, söder Krågeholm, nedströms Svedala AR","2021-06-15",0.06,16.399999999999999,8,82,7.76,15,63.8,7.6,16,150,1100,700,3400,null,null,null,1020,"grumligt"]
[7,"9  Sege å, vid Lilla Mölleberga","2021-06-15",null,16.600000000000001,7.6,78,7.81,8.8000000000000007,65.599999999999994,null,13,120,1100,39,2100,null,null,null,845]
[9,"18 Sege å, nordväst Valdemarsro, järnvägsbron","2021-06-15",null,17.2,5.7,59,7.78,4.0999999999999996,73.5,null,12,94,850,87,1700,null,null,null,810]
[11,"21 Spångholmsbäcken, vid utlopp till Sege å","2021-06-15",null,14.6,6.2,61,7.7,7.7,77.5,null,8.6,120,1000,91,1700,null,null,null,900]
[13,"22b Spångholmsbäcken, bron vid Torupsvägen","2021-06-15",null,14.5,5.4,53,7.68,5.8,74.8,null,11,76,1900,130,4100,null,null,null,920]
[15,"23 Spångholmsbäcken, uppströms Torupsdammen","2021-06-15",null,14.6,3.9,38,7.58,5.3,65,null,15,220,45,570,1700,null,null,null,940]
[17,"10 Torrebergabäcken, vägbron nordost Mölleberga","2021-06-15",null,17.100000000000001,3.4,35,7.52,11,64.8,null,12,150,750,100,1700,null,null,null,830]
[18,"15 Risebergabäcken, ca 250 m uppströms från Sege å","2021-06-15",null,13.8,8.5,82,8,5.5,111,null,4.0999999999999996,63,1100,140,1600,null,null,null,820]
[20,"31 Börringesjön","2021-06-14",null,19.2,9.6999999999999993,105,8.67,42,39.299999999999997,null,26,96,"<10","<10",2800,54,0.3,0.3,950,"gulgrumligt"]
[22,"32 Fjällfotasjön","2021-06-14",null,19.399999999999999,9.9,108,9.06,16,33,null,28,76,"<10","<10",2200,38,0.6,0.5,900,"gröngrumligt"]
[24,"33 Yddingen","2021-06-14",null,20.100000000000001,8.3000000000000007,91,8.44,14,48.6,null,22,54,"<10","<10",1900,40,0.55000000000000004,0.5,800,"brungrumligt"]
[26,"34 Havgårdssjön","2021-06-14",null,19.100000000000001,8.6999999999999993,94,8.23,4.7,30.6,null,10,56,84,130,1100,8,2,1.8,1030,"klart vatten"]
[30,"A1 Alnarpsån, mynningen","2021-06-15",null,16.399999999999999,4.4000000000000004,45,7.69,5.4,98.3,null,6.9,130,2300,41,2800,null,null,null,750]
[32,"A4 Alnarpsån, Coyetgården","2021-06-15",null,14.3,9.6,94,8.06,2.1,97,null,5.2,97,1200,100,1600,null,null,null,730]
[200,"provtagningsuppgifter",null,"Provtagning:Jan Pröjts     Analysansvarig Ekologigruppen:Jan Pröjts   Analysansvarig SGS: Mats Lindgren"]
[250,"juli"]
[20,"31 Börringesjön","2021-07-13",null,21.6,10.1,{"$f":"IF(F59<>\"\",ROUND((F59/((9.266*EXP(-0.04555*E59)+5.374))*100),0),\"\")","v":114},8.83,30,37.799999999999997,null,22,75,"<10","<10",2200,40,0.4,0.4,920,"gulgrumligt"]
[22,"32 Fjällfotasjön","2021-07-13",null,22.1,9.6,110,8.82,13,32.299999999999997,null,29,54,"<10",14,1900,25,0.6,0.5,830,"gröngrumligt"]
[24,"33 Yddingen","2021-07-13",null,21.9,9,102,8.6300000000000008,14,49.5,null,21,47,"<10","<10",1700,36,0.4,0.4,745,"gulgrumligt"]
[26,"34 Havgårdssjön","2021-07-13",null,22.1,9,103,8.41,3.6,28,null,9.3000000000000007,45,"<10",24,920,8.1999999999999993,2.2000000000000002,2,1000,"klart vatten"]
[200,"provtagningsuppgifter",null,"Provtagning:Jan Pröjts     Analysansvarig Ekologigruppen:Jan Pröjts   Analysansvarig SGS: Mats Lindgren"]
[250,"augusti"]
[3,"1  Sege å, vid Brännemölla, uppströms Svedala AR","2021-08-19",null,14.5,8.5,{"$f":"IF(F65<>\"\",ROUND((F65/((9.266*EXP(-0.04555*E65)+5.374))*100),0),\"\")","v":84},7.5,14,50.2,5.6,22,120,1100,130,3000,null,null,null,1310]
[5,"2  Sege å, söder Krågeholm, nedströms Svedala AR","2021-08-19",0.17,16.5,8.5,87,7.71,7.2,44.9,4,11,120,1300,76,2300,null,null,null,1330]
[7,"9  Sege å, vid Lilla Mölleberga","2021-08-19",null,15,7,70,7.7,6.3,35.4,null,7.7,120,920,83,1600,null,null,null,1220]
[9,"18 Sege å, nordväst Valdemarsro, järnvägsbron","2021-08-19",null,15.6,6.6,66,7.63,8.6,45.1,null,7,100,830,35,1200,null,null,null,1140]
[11,"21 Spångholmsbäcken, vid utlopp till Sege å","2021-08-19",null,15,9.5,94,7.7,4.3,59.2,null,7.8,130,1600,86,2100,null,null,null,1230]
[13,"22b Spångholmsbäcken, bron vid Torupsvägen","2021-08-19",null,14.4,5.7,56,7.66,3.4,73.5,null,9.6999999999999993,68,4500,40,5200,null,null,null,1240]
[15,"23 Spångholmsbäcken, uppströms Torupsdammen","2021-08-19",null,15.6,7.1,72,7.77,12,60.9,null,7.1,110,2900,31,3500,null,null,null,1250]
[17,"10 Torrebergabäcken, vägbron nordost Mölleberga","2021-08-19",null,15.6,3.9,39,7.56,5.6,28.3,null,6.5,140,390,36,890,null,null,null,1210]
[18,"15 Risebergabäcken, ca 250 m uppströms från Sege å","2021-08-19",null,15.5,5.8,58,7.96,32,63.8,null,7.1,110,2900,31,3500,null,null,null,1150]
[20,"31 Börringesjön","2021-08-18",null,16.2,10,102,8.48,34,35.4,null,20,74,"<10","<10",2100,43,0.3,0.3,1100,"gulgrumligt"]
[22,"32 Fjällfotasjön","2021-08-18",null,16.600000000000001,8.9,92,8.1199999999999992,12,32.4,null,27,70,"<10",11,2000,23,0.8,0.7,1000,"ganska klart vatten"]
[24,"33 Yddingen","2021-08-18",null,17,8.8000000000000007,91,8.27,22,50.5,null,20,74,"<10","<10",2100,43,0.6,0.6,845,"grumligt"]
[26,"34 Havgårdssjön","2021-08-18",null,18.3,9.9,105,8.4700000000000006,6.2,25.6,null,10,58,48,"<10",1200,17,1.5,1.3,1400,"klart vatten"]
[28,"35 Eksholmssjön","2021-08-18",null,18,8.6999999999999993,92,7.14,7,11,null,23,58,"<10",10,1100,19,1,0.9,1500,"humöst"]
[30,"A1 Alnarpsån, mynningen","2021-08-19",null,15.7,5.5,56,7.55,5.7,78,null,9.3000000000000007,120,1700,68,1900,null,null,null,1120]
[32,"A4 Alnarpsån, Coyetgården","2021-08-19",null,13.7,6.1,{"$f":"IF(F80<>\"\",ROUND((F80/((9.266*EXP(-0.04555*E80)+5.374))*100),0),\"\")","v":59},8.1999999999999993,2.2999999999999998,49.5,null,5.6,72,470,17,800,null,null,null,1100]
[200,"provtagningsuppgifter",null,"Provtagning:Jan Pröjts     Analysansvarig Ekologigruppen:Jan Pröjts   Analysansvarig SGS: Mats Lindgren"]
[250,"september"]
[20,"31 Börringesjön","2021-09-20",null,14.1,11,{"$f":"IF(F83<>\"\",ROUND((F83/((9.266*EXP(-0.04555*E83)+5.374))*100),0),\"\")","v":107},8.58,37,37.1,null,26,98,"<10","<10",2900,80,0.3,0.3,930,"gulgrumligt"]
[22,"32 Fjällfotasjön","2021-09-20",null,14.6,10.1,100,8.16,8.5,34,null,26,51,"<10",170,2100,28,0.7,0.6,845,"gröngrumligt"]
[24,"33 Yddingen","2021-09-20",null,15.2,9.6,96,8.25,17,49.8,null,20,63,"<50","<10",2300,82,0.55000000000000004,0.5,800,"brungrumligt"]
[26,"34 Havgårdssjön","2021-09-20",null,16,11,112,8.32,6.5,26.9,null,9.3000000000000007,54,"<10",120,1200,26,1.4,1.2,1000,"gröngrumligt"]
[200,"provtagningsuppgifter",null,"Provtagning:Jan Pröjts     Analysansvarig Ekologigruppen:Jan Pröjts   Analysansvarig SGS: Mats Lindgren"]
[250,"oktober"]
[3,"1  Sege å, vid Brännemölla, uppströms Svedala AR","2021-10-20",null,11.5,7.5,{"$f":"IF(F89<>\"\",ROUND((F89/((9.266*EXP(-0.04555*E89)+5.374))*100),0),\"\")","v":69},7.62,76,54.5,5.7,21,210,5600,48,7700,null,null,null,1400]
[5,"2  Sege å, söder Krågeholm, nedströms Svedala AR","2021-10-20",0.23,12.9,7.9,75,7.61,39,54.1,4.5999999999999996,11,150,2900,160,4400,null,null,null,1430]
[7,"9  Sege å, vid Lilla Mölleberga","2021-10-20",null,11.9,8.1,75,7.9,5.6,66.2,null,8.3000000000000007,81,2000,18,2900,null,null,null,1255]
[9,"18 Sege å, nordväst Valdemarsro, järnvägsbron","2021-10-20",null,12,8.3000000000000007,77,7.89,8.6999999999999993,59.6,null,7.9,84,1800,50,2600,null,null,null,1200]
[11,"21 Spångholmsbäcken, vid utlopp till Sege å","2021-10-20",null,12.4,7.2,68,7.73,4.2,62,null,7.1,66,1500,28,2200,null,null,null,1300]
[13,"22b Spångholmsbäcken, bron vid Torupsvägen","2021-10-20",null,12.4,7.8,73,7.63,3.9,80.099999999999994,null,13,64,5100,15,6400,null,null,null,1315]
[15,"23 Spångholmsbäcken, uppströms Torupsdammen","2021-10-20",null,12.8,7.6,72,7.51,1.5,70.099999999999994,null,17,94,360,45,1600,null,null,null,1330]
[17,"10 Torrebergabäcken, vägbron nordost Mölleberga","2021-10-20",null,11.5,5.7,52,7.65,5.2,71.3,null,13,98,2400,59,3200,null,null,null,1245]
[18,"15 Risebergabäcken, ca 250 m uppströms från Sege å","2021-10-20",null,13.3,9.5,91,7.88,16,40.9,null,4.5,91,1500,100,1700,null,null,null,1215]
[30,"A1 Alnarpsån, mynningen","2021-10-20",null,12.6,7.2,68,7.7,20,50.3,null,3.8,110,740,44,1000,null,null,null,1145]
[32,"A4 Alnarpsån, Coyetgården","2021-10-20",null,13.2,9.1,87,7.75,6,49.1,null,5.2,110,1000,25,1500,null,null,null,1130]
[200,"provtagningsuppgifter",null,"Provtagning:Jan Pröjts     Analysansvarig Ekologigruppen:Jan Pröjts   Analysansvarig SGS: Mats Lindgren"]
[250,"december"]
[3,"1  Sege å, vid Brännemölla, uppströms Svedala AR","2021-12-20",null,1.3,10.5,{"$f":"IF(F102<>\"\",ROUND((F102/((9.266*EXP(-0.04555*E102)+5.374))*100),0),\"\")","v":74},7.58,20,45.8,5.8,24,120,1900,650,4400,null,null,null,1430]
[5,"2  Sege å, söder Krågeholm, nedströms Svedala AR","2021-12-20",1.1000000000000001,2.7,11.5,85,7.66,19,52.2,6.6,17,170,2700,580,4800,null,null,null,1445]
[7,"9  Sege å, vid Lilla Mölleberga","2021-12-20",null,2.9,12.2,90,7.97,12,61.3,null,16,93,3600,310,4200,null,null,null,1330]
[9,"18 Sege å, nordväst Valdemarsro, järnvägsbron","2021-12-20",null,3.4,11.5,86,7.98,11,69.400000000000006,null,14,90,5200,170,5600,null,null,null,1300]
[11,"21 Spångholmsbäcken, vid utlopp till Sege å","2021-12-20",null,2.4,12.1,88,7.94,7.9,58.3,null,16,66,1400,390,2600,null,null,null,1345]
[13,"22b Spångholmsbäcken, bron vid Torupsvägen","2021-12-20",null,2,12.5,90,7.94,6.3,54.5,null,17,64,920,520,3000,null,null,null,1355]
[15,"23 Spångholmsbäcken, uppströms Torupsdammen","2021-12-20",null,1.9,12.2,88,8.19,7.3,52.2,null,19,66,310,540,2000,null,null,null,1410]
[17,"10 Torrebergabäcken, vägbron nordost Mölleberga","2021-12-20",null,2.6,10,74,7.81,7,70.8,null,16,85,7700,160,7300,null,null,null,1315]
[18,"15 Risebergabäcken, ca 250 m uppströms från Sege å","2021-12-20",null,7,11.1,92,8.14,4.5,110,null,5.7,56,4900,120,5000,null,null,null,1305]
[30,"A1 Alnarpsån, mynningen","2021-12-20",null,4.4000000000000004,10.7,83,7.99,3.4,102,null,5.8,74,12000,55,12000,null,null,null,1245]
[32,"A4 Alnarpsån, Coyetgården","2021-12-20",null,5.3,12.2,96,8.17,2.2000000000000002,88.1,null,3.4,90,11000,19,11000,null,null,null,1230]
[null,""]

{"sheet":"Kommentarer","index":10,"n_rows":132,"n_cols":4,"rows_kept":132,"cut":false,"hidden":false,"merged":[]}
[]
[null,"Sege å"]
[null,"Vattenkontroll - Kommentarer till resultat"]
[]
[null," "]
[null,null,null,"Så här skriver du ut!"]
[null,null,null,"Klicka på aktuell månad till vänster\nObservera att sidbrytningar kan bli olika beroende på skrivare och skrivarinställningar"]
[]
[]
[]
[null,"Lund","2021-"]
[null,"     Segeåns Vattendragförbund och Vattenråd"]
[]
[]
[]
[]
[]
[]
[]
[]
[null,"Lund ","2021-04-07"]
[null,"     Segeåns Vattendragförbund och Vattenråd"]
[]
[]
[]
[]
[]
[]
[]
[]
[null,"Lund ","2021-"]
[null,"     Segeåns Vattendragförbund och Vattenråd"]
[]
[]
[]
[]
[]
[]
[]
[]
[null,"Lund ","2021-10-25"]
[null,"     Segeåns Vattendragförbund och Vattenråd"]
[]
[]
[]
[]
[]
[]
[]
[]
[null,"Lund ","2021-10-25"]
[null,"     Segeåns Vattendragförbund och Vattenråd"]
[]
[]
[]
[]
[]
[]
[]
[]
[null,"Lund ","2021-10-25"]
[null,"     Segeåns Vattendragförbund och Vattenråd"]
[]
[]
[]
[]
[]
[]
[]
[]
[null,"Lund ","2021-10-25"]
[null,"     Segeåns Vattendragförbund och Vattenråd"]
[]
[]
[]
[]
[]
[]
[]
[]
[null,"Lund","2021-10-25"]
[null,"     Segeåns Vattendragförbund och Vattenråd"]
[]
[]
[]
[]
[]
[]
[]
[]
[null,"Lund ","2021-12-22"]
[null,"     Segeåns Vattendragförbund och Vattenråd"]
[]
[]
[]
[]
[]
[]
[]
[]
[null,"Lund ","2021-12-22"]
[null,"     Segeåns Vattendragförbund och Vattenråd"]
[]
[]
[]
[]
[]
[]
[]
[]
[null,"Lund  ","2021-"]
[null,"     Segeåns Vattendragförbund och Vattenråd"]
[]
[]
[]
[]
[]
[]
[]
[]
[null,"Lund ","2022-02-10"]
[null,"     Segeåns Vattendragförbund och Vattenråd"]
[]
[]
[]
[]
[]
[]
[]
[]
[null,"Lund ","2022-"]
[null,"  Segeåns Vattendragförbund och Vattenråd"]

{"sheet":"Kontakt","index":11,"n_rows":19,"n_cols":4,"rows_kept":19,"cut":false,"hidden":false,"merged":[[20,3,21,3],[22,3,23,3]]}
[null,"Sege å"]
[null,"Vattenkontroll - kontaktpersoner"]
[]
[null,"Konsult:",null,"Uppdragsgivare:"]
[null,"Ekologigruppen AB",null,"Segeåns Vattendragsförbund och Vattenråd"]
[null,"Stora Södergatan 8C",null,"c/o Svedala kommun"]
[null,"222 23 Lund",null,"Bygg- och miljökontoret"]
[null,null,null,"Christel Strömsholm Trulsson"]
[null,"Telefon: 046-106750 ",null,"233 80 Svedala"]
[null,null,null,"Telefon: 040-40 80 00"]
[null,null,null,"Telefax: 040-40 25 18"]
[null,"E-post:",null,"E-post:"]
[null,"jan.projts@ekologigruppen.se",null,"christel.stromsholm@svedala.se"]
[null,null,null,"Jenny.Ahlqvist@svedala.se"]
[null,"Hemsida:",null,"Hemsida:"]
[null,"http://www.ekologigruppen.se",null,"http://www.segea.se/"]
[]
[null,"Kontaktperson: Jan Pröjts",null,"Kontaktperson: Christel Strömsholm Trulsson och"]
[null,null,null,"Jenny Ahlqvist"]

{"sheet":"Länkar","index":12,"n_rows":19,"n_cols":6,"rows_kept":19,"cut":false,"hidden":false,"merged":[]}
[]
[null,"Sege å"]
[null,"Vattenkontroll - länkar till äldre resultat mm"]
[null,"Länkar till nationell databas, SLU (Sveriges LantbruksUniversitet). "]
[null,"Välj data från en eller flera stationer. Välj från stationskarta eller tabell."]
[null,"Internetuppkoppling krävs för denna funktion."]
[]
[null,"SLU, MVM*",null,"Vattendrag                 SLU                 t o m 2012",null,"Sjöar                SLU                 t o m 2012"]
[null,"* Välj i Undersökningar, t ex: \"SRK Höje å\" ",null,"Länkar till äldre databaser"]
[]
[null,"Segeåns vattendragsförbund"]
[]
[null,"VattenAtlas"]
[null,"Vattenkartan"]
[null,"VISS, länsstyrelsernas databas för vattendata"]
[]
[null,"Länsstyrelsen i Skåne län"]
[null,"Vattenmyndigheterna"]
[null,"Naturvårdsverket"]

{"sheet":"Förklaring","index":13,"n_rows":48,"n_cols":8,"rows_kept":48,"cut":false,"hidden":false,"merged":[]}
[]
[null,"Sege"]
[null,"Vattenkontroll - förklaring till färgmarkeringar"]
[]
[null,"Indelning av halter och värden baseras på:"]
[null,"Bedömningsgrunder för miljökvalitet - Sjöar och Vattendrag "]
[null,"Naturvårdsverket 1999 (Rapport 4913)"]
[]
[null,"Observera att bedömningsgrunderna rymmer fem klasser:"]
[]
[null,"Följande parametrar ingår i den automatiska färgmarkeringen:"]
[]
[null,"klass:",1,2,3,4,5,"Kommentar"]
[null,"pH, surhet","nära neutralt","svagt surt","måttligt","surt","mycket surt"]
[null,"pH-värde",">6,8","6,5-6,8","6,2-6,5","5,6-6,19","<5,6"]
[null,"färg, färgning","obetydligt","svagt","måttligt","betydligt ","starkt"]
[null,"mg Pt/l","<10","25-10","25-60","61-100",">100"]
[null,"grumlighet","obetydligt","svagt","måttligt","betydligt ","starkt"]
[null,"FNU/FTU","<0,5","0,5-1","1,0-2,5","2,6-7,0",">7,0"]
[null,"syrehalt, tillstånd","syrerikt","måttligt","svagt","syrefattigt","syrefritt","i sjöar bedöms bottenvatten"]
[null,"mg O2/l",">7","5-7","3-5","1-2,9","<1"]
[null,"totalfosfor, halt","låg","måttligt hög","hög","mycket hög","extremt hög","egentligen sjöar"]
[null," µg/l","<12,5","12,5-25","25-50","51-100",">100","medel maj-oktober"]
[null,"totalkväve, halt","låg","måttligt hög","hög","mycket hög","extremt hög","egentligen sjöar"]
[null," µg/l","<300","300-625","625-1250","1251-5000",">5000","medel maj-oktober"]
[]
[]
[null,"Observera att klassningssystemet egentligen är uppbyggt för att karaktärisera en provpunkt"]
[null,"där en serie av provresultat föreligger, t ex 12 prover under ett år. Oftast rekommenderas "]
[null,"att medelvärdena för mätperioden klassas men i fallet syretillstånd skall klassningen baseras"]
[null,"på minimivärdet för mätperioden."]
[]
[]
[null,"Varför färgmarkering/avmarkering?"]
[]
[null,"Färgmarkeringsfunktionen har lagts till för att uppmärksamma läsaren på anmärkningsvärt höga/"]
[null,"låga värden. Avmarkeringsfunktionen finns för att användaren enkelt skall kunna välja hur arket"]
[null,"skall studeras eller skrivas ut. "]
[]
[null,"Färgmarkeringar i resultatrapporter ingår ej i Ekologigruppens ackreditering."]
[]
[]
[null,"Referenser:"]
[null,"De referenser Ekologigruppen använder som stöd för tolkningar av kemidata och indexberäkningar är"]
[null," följande:"]
[null,"Naturvårdsverket 1999. Bedömningsgrunder för miljökvalitet - Sjöar och vattendrag. Rapport 4913."]
[null,"Havs- och vattenmyndighetens föreskrifter om klassificering och miljökvalitetsnormer avseende "]
[null,"   ytvatten, HVMFS 2019:25. Havs- och vattenmyndighetens författningssamling."]

{"sheet":"Versionshistorik","index":14,"n_rows":92,"n_cols":5,"rows_kept":92,"cut":false,"hidden":true,"merged":[]}
["Problem och versionsuppdateringar",null,null,"= Ej löst"]
[]
["Datum","Version","Problembeskrivning / uppdatering","Lösning","Sign"]
["Infoga nya rader under denna rad"]
[]
["2021-06-02","158","Överfört till Sege å.\nNy skrivarknapp på rapportfliken (endast införd i Sege å)",null,"BW"]
["2021-05-27","157","Resultatfliken visar inte värden som är 0 (t ex temp)","I formeln =OM(Rapport!D10=0;\"\";Rapport!D10) hämtas inte värden som är 0 i Rapport-fliken. Ändrat till att kolla efter tomma celler: =OM(Rapport!D10=\"\";\"\";","BW"]
["2021-05-05","156","Version före överföring till Höje å",null,"BW"]
["2021-02-05","155","Lagt till skydd för fliken Rapport i normalläga (dataceller är olåsta)","Tillagt i makro Lockup och Lock_normal","BW"]
["2021-01-13","155","fel enhet i flera tabeller på diagramsidan (mg/l ska vara µg/l)","Fixat (ej fel i Saxå-filen)","BW"]
["2021-01-11",null,"Problem att hantera decimaltecken på värden > eller < i historiken. Om tecknet tas bort kan talet inte tolkas som ett tal om decimalseparatorn är fel.","Tillfällig lösning, ändrat till komma (eftersom troligen de flesta använder komma)","BW"]
["2020-11-26","154","Fel formel flik Diagram. I rutan Årets resultat är formeln för dec fel (hänvisar till nov-värdet)","Korrigerat","BW"]
["2020-11-25",null,"Skrivit in Kävlingeån nov",null,"BW"]
["2020-10-29",null,"Skrivit in Kävlingeån okt",null,"BW"]
["2020-09-29",null,"Skrivit in Kävlingeån sept",null,"BW"]
["2020-09-23","153","Fixa så att flikarna Resultat och Sorterat är skyddade i normalläget","Lagt in ny knapp med makro Lock_normal, som skyddar och döljer på normalnivå","BW"]
["2020-09-01","152","Uppdaterat med Kävlingeån aug",null,"BW"]
["2020-07-22","152","Stor fil","Komprimerat bilder på kommentar-sidan. Upplösning 150","BW"]
["2020-07-22","152","Årets diagram, vissa felaktiga","Kaoorigerat. Från diagram pH och neråt var diagramområdet fel -> jan visades inte","BW"]
[null,null,null,"Lagt in data K-ån juli","BW"]
["2020-07-02","151","Inlagd EIG-logga i Kommentars-utskrift","Låg tidigare på rad 9, men flyttades. Nu inlagd i Sidhuvud. Vänster + 16 blanksteg.\nToppmarginal ändrad till 2.8 cm","BW"]
["2020-07-02","150","Skala ändrad på PH axel till 6-9",null,"BW"]
["2020-07-02",null,"Skrivit in resultat Kävl juni",null,"BW"]
["2020-06-11","149","Årets diagram visas olika beroende på office-version","Ändrat så att data till årets diagram klistras in i sidokolumner (AR, AS) och omvandlas till värden och datum.","BW"]
["2020-05-28","148","Rättade fel","Fel klass på linje i diagram Gruml och Syreh. Högerjusterat kolumnen med årets resultat i diagragfliken. Förklaring Syrgashalt '5-7 (för att inte visa datum)","BW"]
["2020-05-28",null,"Rättat kolumnhämnvisnin i Diagram/Årets resultat","Fel kolumnhänvisning från maj och nedåt för vissa parametrar (Gruml, BOD)","BW"]
["2020-05-28",null,"Inlagt Kävlingeån - maj. Låst flik Stn 3, utom data-celler",null,"BW"]
["2020-05-28","147","Fr o m nu måste uppdateringar göras även i Saxån. Viktigt därför att notera ordentligt vilka uppdateringar som görs",null,"BW"]
["2020-05-28",null,"Låst formler i rapportfliken (och låst upp dataceller)","Rapportfliken ska alltså vara skyddad. Dataceller är upplåsta. Låses i exoprt-makron","BW"]
["2020-05-27",null,"Skapat för Saxån",null,"BW"]
["2020-05-27","146","Knappar på Rapportsidan","Knapparna låsta  till raderna (Egenskaper - Flytta med celler men ändra inte storlek) för att följa med när rader infogas.","BW"]
["2020-05-19","145","Knappar på Statistik/diagram tillsnyggade",null,"BW"]
["2020-05-19",null,"Fixat kommentarstext med lite mer marginal.","Första raden - stycke -Avstånd före: 14pt \nVänstermarginal ändrat till 0.5 samt avstånde efter 5 pt (tätare melan stycken)\nRaden under kommentar ändrad till: Radhöjd 80 för att hela texten ska få plats om mycket text.\nRutans höjd 15.5 cm","BW"]
["2020-05-18",null,"Testat skrivarknapp. Ej inlagd. Får först fundera lite på hur utskrift av resultat ovh kommentar ska styras",null,"BW"]
["2020-05-15","144","Layout",null,"BW"]
["2020-05-14","143","<värden visas som 0 i diagram","Går att lösa genom att hämta diagramvärden fån formelkolumnen (C..) som används för statistikberäkning. Problemet är då att tomma celler visas som 0 i diagram. Går att lösa genom att ersätta \"\" med SAKNAS(), men då funkar inte statistikberäkningen","BW"]
["2020-05-14",null,"Lagt in diagram för alla parametrar"]
["2020-05-14",null,"Förhindra att årsfil skrivs över vid fel vid export","Lagt in felhaterare i makro Export som gör att filen stängs utan att spåras om något går fel vid export"]
["2020-05-14",null,"Fixat färgmarkering alla klasser alla parametrar","Makro Färg ","BW"]
["2020-05-13","142","Snyggat till statistik och diagram","Öppnat (oskyddat) diagram så att de blir redigerbara i kundversionen","BW"]
["2020-05-13",null,"Lagt till färger för pH","Makro Färg. OBS! Måste numrera 1-5. Blå=33, Gul =4"]
["2020-05-13","141","Startsidan. Fixat länkar och reducerat knappar. Layout",null,"BW"]
["2020-05-13",null,"Lagt in marginaler i kommentar","Inlagt även i mall: Överst tom rad Calibri Bröd, 5. "]
["2020-05-08","140","Fler diagram tillagda. Denna version används för \"skarp\" redovisning av resultat i Kävlingeån (april)",null,"BW"]
["2020-05-07","139","Lagt in omvandling från formler till värden även på sorterat fliken","Uppdaterat Makro Export","BW"]
["2020-05-07",null,"Ändrat namn på exportfil till *_public","Uppdaterat Makro Export"]
["2020-05-06","138","Layoutförändringar. Användarguide","Dokument på www.ekologgrupen.com\\vattenkontroll","BW"]
["2020-05-06",null,"Snyggat till diagra, årets resultat.","Svårt att få samma skala som andra diagrammet"]
["2020-05-06",null,"Ändrat min och max i statisstik. Även dessa hämtar värde från < (>)"]
["2020-05-04","137","Slagit ihop knappar på startsidan. Makro Lockup ()",null,"BW"]
["2020-05-04",null,"Snyggat till layout av export-filen","Makr Exportera"]
["2020-05-04",null,"Formler flyttade till Rapport-fliken. ","Formler omvandals till värden vid Export, och kan därför vara synliga i vår arbetskopia. Även Resultatfliken omvandals till värden för att dölja formler för uppdragsgivaren. Formeln inleds med OM för att undvika nollor.","BW"]
["2020-04-29","136","Uppdaterad med aktuell data (april) Kävlingeån",null,"BW"]
["2020-04-28","135","Förbättrat inläggning av kommentar på startsidan","Enklare välja månad. Mer precis placering (.Top  .Left).\nFungerar visserligen, men känns som en seg och klumpig lösning","BW"]
["2020-04-27","134","Lagt till \"hård\" döljning på blad som ska döljas, vilket gör att de inte kan tas fram i excel utan endast i VBA editorn","xlVeryHidden (istället för False).\nHist_data och RS, samt blad som döljs i exportvarianten","BW"]
["2020-04-27",null,"Lagt till lås för \"Statistik\" i makron Sortera_statistik","Detta gör det möjligt att skydda alla blad","BW"]
["2020-04-27",null,"Lagt till lås för \"Resultat\" och \"Sorterat\" i makron Exportra",null,"BW"]
["2020-04-24","133","Sidorna Resultat och Sorterat kan vara låsta.\nFixat till kommentarer. Uppdaterat guide","Lagt till lås och upplåsningsfuntion i makron Färg och Avmarkera","BW"]
["2020-04-23","132","Lagt till år 2010-2011 i historik","Ändrat till 2000 rader i Makro Sortera_statistik","BW"]
["2020-04-17","131","Förbättring av kommentarsfliken","Provar med inbäddade Word-dokument","BW"]
["2020-04-15","130","Påbörjat layoutförändringar.","EIGs färgschema?","bw"]
["2020-04-07","129","Utvecklat startsidan och makron Exportera\nNy flik \"Info\"",null,"bw"]
["2020-04-07",null,"Knappen Uppdatera flyttad till Rapportsidan.\nTas bort i den exporterade filen",null,"bw"]
["2020-04-06","128","Tagit bort knappen \"Uppdatera tabell\" i flik Statistik. Istället kopplat makrot direkt till \"Väljlisten\".\nNy flik \"Info\"",null,"bw"]
["2020-04-03","127","Ändrat beräkning av medelvärde och standardavvikelse i Statistikdelen","< (och >) omvandlas till värde. Kolumn CD… i \"Statisitk\"","bw"]
["2020-04-03",null,"Dolt flik \"hist data\"","Lagt till ta fram och dölj i makron Sortera_Statistik","bw"]
["2020-04-03",null,"Utveckling statistik och diagram. Tillagt så att årets resultat hämtas från RS","Tillagd kolumn (B) i RS","bw"]
["2020-03-18","126","Utveckling statistik och diagram",null,"bw"]
["2020-03-16",null,"Körfel om försöker dölja dolt blad. Flik RS döljs av makron Sortera. Körfel om man sen försöker spara kopia","Måste dela upp på en flik i taget. On error resume next ingen bra lösning i detta fall - kan innebära att fel flik döljs. ","bw"]
["2020-03-13","125","Sorterat: <-värden ingår i medelvärde","Medelvärde hämtas från kolumn A? där värde utan tecken hämtas från kolumn ?","BW"]
["2020-03-12","124","Förbättrat Export-knappen.\nDöpt om makro-moduler\nPåbörjat förbättring av diagram",null,"BW"]
["2020-03-11",null,"Rutan: Radera blad utan att bekräfta\nLåsa (skydda) VBA. \"kontroll\"","Behövs ej. Löst på annat sätt","BW"]
["2020-03-11","123","Fixat utskrift Rapport.\n Lagt till ruta (makro) för att skapa exporterbar fil","Makro Exportera_fil","BW"]
["2020-02-26","122","Uppdatering fr o m 2012 i flik Hist_data","Ändrat makro Sortera_statistik () till 1000 rader","BW"]
["2020-02-24","121","Uppdatering flik Makron","Markerat i Makro \"Färgmarkera\" vilken parameter som gäller för respektive kolumn (så att den blir lättare att ändra)","BW"]
["2020-02-21","120","Uppdatering flik Makron",null,"BW"]
["2020-02-21",null,"Är det känsligt att ha formler på Resultatfliken? Bättre med makro som kopierar n data från Rapportfliken?","Kopiera-makro. Ruta \"Uppdatera\"","BW"]
["2020-02-14","119","Makrofliken",null,"BW"]
["2020-02-13","118","Diagramfix. Lagt till dena flik och Makron",null,"BW"]
["2020-02-12","117","Överförd til xlsm",null,"BW"]
["2020-02-17","017","Fixat automatisk datum-angivelse på Kommentars-flik. Återställt till MEDEL på Sorterat-fliken","Även löst problem med Namngivna celler som hängt kvar sedan gamla årsfiler","BW"]
["2020-02-07",null,"Problem med AVERAGEA (och motsv STD)","AVERAGEA funkar inte på sorterat-fliken eftersom tomma celler där inte är tomma, och räknas då som 0","BW"]
["2020-02-07","016","Uppdaterat diagramsidan",null,"BW"]
["2020-02-04","015","Förbättring i diagramdelen och statistik","Funktion för att utföra sortering i dolt blad, så att flik RS kan vara dold.\nPå statistik-fliken bytt från MEDEL till AVERAGEA och d:o för STD","BW"]
["2020-01-31","014","Förbättring i diagramdelen",null,"BW"]
["2020-01-31",null,"Test_arsfil2020. Demo till rönneå-anbud",null,"BW"]
["2020-01-31","013",null,"Förbättrad lösning för att hitta sista rad i statistikdelen","BW"]
["2020-01-31","012","Layoutförbättringar. Vattenföringssidan förbättrad",null,"BW"]
["2020-01-30","011","Fixat småfel, knappar, länkar",null,"BW"]
["2020-01-30","010","Ny lösning på medel, max, min i Statistik-flik","Annan makro","BW"]
["2020-01-30","002","Medel, max, min, Statistik-flik","Bra lösning, men blir svårt att lösa diagram","BW"]
["2020-01-29","001","Första version",null,"BW"]

{"sheet":"Makron m m","index":15,"n_rows":44,"n_cols":5,"rows_kept":44,"cut":false,"hidden":true,"merged":[]}
["OBS!","Makrohanteraren är skyddad, för att få fram makron gäller lösenordet \"kontroll\""]
["Modul","Namn","Funktion","Använd i","Övrigt"]
["Färgmarkering","Färg ()","Används för att färgmarkera Syre, pH, Gruml, Tot-P, Tot-N\nTillagd funktion öppnar blad och skyddar blad. För att bladet ska kunna vara skyddat","Resultat, Sorterat","Syre, pH, Grum, Tot-P, Tot-N\nOBS! Kolumnnamn kan behöva ändras i makron\nDenna makro funkar både på punkt och komma"]
[null,"Avmarkera ()","Används för att avmarkera\nTillagd funktion öppnar blad och skyddar blad. För att bladet ska kunna vara skyddat","Resultat, Sorterat","Syre, pH, Grum, Tot-P, Tot-N\nOBS! Kolumnnamn kan behöva ändras i makron"]
["Utskrifter","JANutskrift ()\nFEButskrift ….","Skriva ut rapport","Rapport","Områden behöver ställas in för varje månad"]
[null,"JAN_rapp ()\nFEB_rapp ….","Hoppar till rätt månad på Rapportsidan","Rapport","Rad behöver ställas in för varje månad"]
[null,"JAN_kom ()\nFEB_kom ….","Hoppar till rätt månad på Kommentarsidan och frågar om man vill skriva ut","Kommentar","Startrad och områden behöver ställas in för varje månad"]
["Sorterat","NY_Sortering ()","Flyttar data från ett blad till ett annat och sorterar","Resultat (och flyttar till RS)","Områden kan behöva justeras.\nTillåter sortering på dolt blad (makron tar fram och döljer bladet)"]
[null,"NY_Sortering_old ()","Sorterar data lägre ned på samma blad","Används ej","\n"]
["Statistik","Sortera_statistik ()","Väljer provpunkt och sorterar statistik från fliken Hist_data","Statistik, Hist_data (hämtar värden från den senare)","Områdesinställningar kan behöva justeras"]
["Exportera","Exportera_fil ()","Knapp på startsidan som förbereder fil för exprot till kund. Döljer flikar, skyddar flikar (med lösenord), tar bort varningstext från startsidan och spara som ny fil med tillägget_public, m m.","Färdig fil, klar för leverans","OBS! Delar kan behöva justeras för nya projekt. Kolla specifikt flikar och fliknamn. Kommentar Button 4?"]
["Diverse","Lockup ()","Låser upp skyddade blad, och tar fram dolda blad (se nedan)","Start-fliken","Button 2"]
[null,"TaframBlad ()","Tar fram flikarna \"RS\" och \"Hist_data\"","Lockup ()"]
[null,"Lock_normal ()","Skyddar och döljer blad som öppnats med Lockup","Start-fliken","Button 3"]
[null,"DoljBlad ()","Döljer flikarna \"RS\" och \"Hist_data\"","Lockup ()"]
[null,"Objectkopiering ()","Hämtar objectnamn från cell","Används inte separat, men finns inbäddad i Exportmakron"]
["Xtra",null,"Diverse små och testmakron"]
["Formler i flikar:"]
["Start","Högra rutan, K2-W16","Diverse knappar och formler som tas bort i export-filen","Arbetsfilen","Om rader eller kolumner läggs till här måste makron ändras"]
["Rapport",null,null,null,"Data skrivs in på detta, och endast detta blad. OBS! Kan innehålla formler, t ex för syrgasmättnad och alk.\nKolumn A är dold och innehåller sorteringsordning"]
["Kommentar","Inbäddade Word-dokument","Ett dokument för varje månad; Object 1, …Object 12",null,"Kopiera INTE (och klistra in) objekten, då kan det bli fel på numreringen.\nFormatmall: Kommentar_mall.docx"]
["Resultat","De flesta celler","Datum och resultat hämtas från flik Rapport",null,"Sidan måste justeras för nya projekt eller provpunkter. Detta görs troligen bäst genom att kopiera och klistra in rader. Radstrukturen ska se ut som Rapportsidan, men några rader färre i huvudet"]
["RS","Kolumn A","Dold flik som levererar data till flik Sorterat.","Sorterat","Kolumn A används av diagramsidan för att hitta senaste resultat. Kolla att området stämmer i makro Ny_sortering"]
[null,"Kolumn B",null,null,"Kolumn B används av diagramsidan för att sortera ut årets resultat. Övriga kolumner förskjutna två kolumner i förhållande till \"Sorterat\"."]
["Sorterat","De flesta celler","Datum och resultat hämtas från flik RS (dold flik).\nÄven formler för medel, max, min",null,"Sida kan vara skyddad. Färgmarkerings makron sköter upplåsning"]
[null,"Kolumn AD-AO","Kopia av värden, men utan <-tecken. Används för beräkning av medelvärde","Medelvärdesberäkning","Kolumner kan behöva justeras. Kolumnerna är dolda"]
["Stn 3",null,"Projektspecifik",null,"Inga formler. OBS! Kolla Exprot-makron vad gäller denna flik"]
["Vattenföring",null,"Diagram hämtar data från A101:A466 (ev B466)"]
["Statistik",null,"Innehåller många formler varav några viktiga listas nedan",null,"OBS!! Vid nytt projekt. Kör inte statistik förrän historik och provpunkter är ordentligt inlagda. Kan bli mycket extra jobb om man kör innan det är inlagt."]
[null,"Valrutan","Hämtar från flik Provpunkter, kolumn B. Lämnar svar i Provpunkter;G1",null,"Valet är direkt kopplat till makron Sortera_statistik. Matrisen måste även ändras i cell \"Diagram\" R4\nOmrådet (valmatrisen) ska ändras här och i cel B8"]
[null,"Statistik-rutan","Formler för medel, …. Längst ner i vänstra hörnet står \"SISTA\" för att markera sista rad","\"SISTA\" används i makron Sortera_statistik"]
[null,"Rad 9","Innehåller info för inkopiering","Kopieras in i nytt område efter rensning"]
[null,"Kolumn AA -->\nKolumn CD -->","Innehåller formler för beräkning av statistik och stöd till diagram","Kopieras in i nytt område efter rensning"]
["Diagram",null,"Generellt beroende av ändringar i \"Statistik\"",null,"Extra känslig för ändringar rad 9 i \"Statistik\""]
[null,"I4, K4","Hämtar värde från (max, min datum) Statistik"]
[null,"D4","Hämtar provpunkt från \"Statistik\""]
[null,"R4","Kollar  i \"Provpunkter\" efter provtagningsfrekvens och hittar därefter senaste provtagning i \"RS\"",null,"Behöver ändras för nytt program. Kolla att matrisen stämmer, och även olika val som i sin tur refererar till plats i flik RS"]
[null,"N9, m fl","Hittar senaste värde i flik \"RS\""]
["Hist_data",null,"DOLD. Innehåller historisk data sorterad","Statistik ","Ny data: Kolla så att komma ersätts med punkt. Kolla så att alla tal är tal, även datum.\nOm innehåller mer än 2000 rader data måste makro \"Sortera_statistik\" ändras"]
["Formler",null,"Dold. Projektspecifik","Formeler för t ex beräkning av Alk och syrgasmättnad i Rapportfliken"]
["Provpunkter",null,"Dold","Flera formler i andra blad hänvisar till denna","A:sorteringsordning, B:Namn, c:provtagningsfrekvens"]
["Kontakt"]
["Länkar"]
["Förklaring",null,"Länk till fliken från \"Resultat\" och \"Sorterat\"",null,"Externa länkar"]

{"sheet":"Provpunkter","index":16,"n_rows":16,"n_cols":7,"rows_kept":16,"cut":false,"hidden":true,"merged":[]}
[1,"1  Sege å, vid Brännemölla, uppströms Svedala AR",6,null,null,null,1]
[2,"2  Sege å, söder Krågeholm, nedströms Svedala AR",6]
[3,"9  Sege å, vid Lilla Mölleberga",6]
[4,"18 Sege å, nordväst Valdemarsro, järnvägsbron",6]
[5,"21 Spångholmsbäcken, vid utlopp till Sege å",6]
[6,"22b Spångholmsbäcken, bron vid Torupsvägen",6]
[7,"23 Spångholmsbäcken, uppströms Torupsdammen",6]
[8,"10 Torrebergabäcken, vägbron nordost Mölleberga",6]
[9,"15 Risebergabäcken, ca 250 m uppströms från Sege å",6]
[10,"31 Börringesjön",5]
[12,"32 Fjällfotasjön",5]
[13,"33 Yddingen",5]
[14,"34 Havgårdssjön",5]
[15,"35 Eksholmssjön",1]
[16,"A1 Alnarpsån, mynningen",6]
[17,"A4 Alnarpsån, Coyetgården",6]

{"sheet":"Formler","index":17,"n_rows":7,"n_cols":42,"rows_kept":7,"cut":false,"hidden":true,"merged":[[3,25,3,26]]}
["Detta blad används endast av Ekologgruppens personal. Bladet är skrivskyddat."]
["Formler för syremättnad"]
["Kopiera cellerna i kolumn F-H på rad 5 till de rader i bladet Resultat där syremättnad och alkalinitet ska beräknas"]
["Sorterings-","Provtagningspunkt","Provtagn"," Vattenf"," Temp"," Syreh","Syrem","  pH"," Alkalin","Gruml","  Kond","BOD7","PO4-P","Tot-P"," NO3+2-N","NH4-N"," Tot-N","Abs,filt","provtagare/projektledare","Klor a","Siktdjup","Het-bakt.","E coli","Anmärkning",null,null,null,"provp","SNV","2009-2011","2009-2011","provp","SNV","2009-2011","2009-2011",null,null,"provvolym","HCL,förbruk",null,null,"  mol/l"]
[null,null,null,null,null,null,{"$f":"ROUND((F5/((9.266*EXP(-0.04555*E5)+5.374))*100),0)","v":0},null,null,null,null,null,null,null,null,null,null,null,null,null,null,null,null,null,null,null,null,null,null,null,null,null,null,null,null,null,null,null,null,null,null,0.02]
[null,null,null,null,null,null,"Kopiera cell G ovan till fliken resultat"]
[null,null,null,null,null,null,"Ersätt sedan med värde"]