{"text_format":"1","workbook":"xlsx","n_sheets":18,"sheets":["Start","Resultat","RS","Sorterat","Stn 18","Vattenföring","Statistik","Diagram","Hist_data","Rapport","Kommentarer","Kontakt","Länkar","Förklaring","Versionshistorik","Makron m m","Provpunkter","Formler"],"not_rendered":{"charts":23,"images":22,"macros":1,"external_links":0,"defined_names":5,"comments":7,"pivot_tables":0},"unopened":[],"bounds":{"document_bytes":16777216,"sheet_cells":100000,"rows_first":2000,"rows_last":500,"rows_between":2000,"halvings":0,"cell_chars":16384,"cell_head_chars":4096},"cells_cut":0,"cells_raw":0,"read":"whole","date_system":"1900"}

{"sheet":"Start","index":0,"n_rows":15,"n_cols":8,"rows_kept":15,"cut":false,"hidden":false,"merged":[]}
[]
[]
[null,null,null,null,"Sege å - vattenkontroll 2021"]
[]
[]
[null,"Foto: ??"]
[null,null,"Resultat sorterat per månad",null,"Resultat sorterat per provpunkt",null,null,"Diagram och statistik"]
[]
{"$rows_left_out":8}
{"sheet":"Resultat","index":1,"n_rows":109,"n_cols":21,"rows_kept":109,"cut":false,"hidden":false,"merged":[]}
[null,"Sege å 2021\nResultat"]
[null,null,null,"Peka på röda trianglar (►) för förklaring av parametrar"]
["Sorterings-","Provtagningspunkt","Provtagn"," Vattenf"," Temp"," Syreh","Syrem","  pH","Gruml","  Kond","BOD7","TOC","Tot-P"," NO3+2-N","NH4-N"," Tot-N","Klor a","Siktdj VK","Siktdj","   Tid","Anmärkning"]
["ordning","Nr Läge","datum","    m3/s","  °C","mg/l","%",null,"  FNU","mS/m","mg/l","mg/l"," µg/l","  µg/l","  µg/l","  µg/l","mg/m3","m","m"]
[250,"februari"]
[3,"1  Sege å, vid Brännemölla, uppströms Svedala AR","2021-02-15","",0.4,14,97,7.78,12,50.4,4.9000000000000004,22,65,1800,250,3600,{"$f":"IF(Rapport!Q10=\"\",\"\",Rapport!Q10)","v":""},{"$f":"IF(Rapport!R10=\"\",\"\",Rapport!R10)","v":""},{"$f":"IF(Rapport!S10=\"\",\"\",Rapport!S10)","v":""},{"$f":"IF(Rapport!T10=\"\",\"\",Rapport!T10)","v":1545},{"$f":"IF(Rapport!U10=\"\",\"\",Rapport!U10)","v":"is i kanten "}]
[5,"2  Sege å, söder Krågeholm, nedströms Svedala AR","2021-02-15",0.49,1.2,13.5,95,7.8,15,54.2,5,19,86,2900,300,4100,{"$f":"IF(Rapport!Q11=\"\",\"\",Rapport!Q11)","v":""},{"$f":"IF(Rapport!R11=\"\",\"\",Rapport!R11)","v":""},{"$f":"IF(Rapport!S11=\"\",\"\",Rapport!S11)","v":""},{"$f":"IF(Rapport!T11=\"\",\"\",Rapport!T11)","v":1600},{"$f":"IF(Rapport!U11=\"\",\"\",Rapport!U11)","v":"is i kanten "}]
[7,"9  Sege å, vid Lilla Mölleberga","2021-02-15","",0,14,96,7.92,11,68.3,"",16,83,3300,300,3900,{"$f":"IF(Rapport!Q12=\"\",\"\",Rapport!Q12)","v":""},{"$f":"IF(Rapport!R12=\"\",\"\",Rapport!R12)","v":""},{"$f":"IF(Rapport!S12=\"\",\"\",Rapport!S12)","v":""},{"$f":"IF(Rapport!T12=\"\",\"\",Rapport!T12)","v":1445},{"$f":"IF(Rapport!U12=\"\",\"\",Rapport!U12)","v":"istäckt"}]
{"$rows_left_out":102}
{"sheet":"RS","index":2,"n_rows":170,"n_cols":23,"rows_kept":170,"cut":false,"hidden":true,"merged":[]}
[{"$f":"TRIM(CONCATENATE(D1,E1))","v":"ProvtagningspunktProvtagn"},null,"Sorterings-","Provtagningspunkt","Provtagn"," Vattenf"," Temp"," Syreh","Syrem","  pH","Gruml","  Kond","BOD7","TOC","Tot-P"," NO3+2-N","NH4-N"," Tot-N","Klor a","Siktdj VK","Siktdj","   Tid","Anmärkning"]
[null,null,"ordning","Nr Läge","datum","    m3/s","  °C","mg/l","%",null,"  FNU","mS/m","mg/l","mg/l"," µg/l","  µg/l","  µg/l","  µg/l","mg/m3","m","m"]
[{"$f":"TRIM(CONCATENATE(D3,E3))","v":"1 Sege å, vid Brännemölla, uppströms Svedala AR44242"},{"$f":"CONCATENATE(D3,MONTH(E3))","v":"1  Sege å, vid Brännemölla, uppströms Svedala AR2"},3,"1  Sege å, vid Brännemölla, uppströms Svedala AR","2021-02-15","",0.4,14,97,7.78,12,50.4,4.9000000000000004,22,65,1800,250,3600,"","","",1545,"is i kanten "]
["1 Sege å, vid Brännemölla, uppströms Svedala AR44305","1  Sege å, vid Brännemölla, uppströms Svedala AR4",3,"1  Sege å, vid Brännemölla, uppströms Svedala AR","2021-04-19","",9.8000000000000007,11.2,99,7.81,11,47.7,6.3,22,66,1300,"<10",2900,"","","",1050,"grumligt "]
["1 Sege å, vid Brännemölla, uppströms Svedala AR44362","1  Sege å, vid Brännemölla, uppströms Svedala AR6",3,"1  Sege å, vid Brännemölla, uppströms Svedala AR","2021-06-15","",16.399999999999999,4.3,44,7.41,18,45.3,7.7,26,160,590,250,3300,"","","",1000,"grumligt"]
["1 Sege å, vid Brännemölla, uppströms Svedala AR44427","1  Sege å, vid Brännemölla, uppströms Svedala AR8",3,"1  Sege å, vid Brännemölla, uppströms Svedala AR","2021-08-19","",14.5,8.5,84,7.5,14,50.2,5.6,22,120,1100,130,3000,"","","",1310,""]
["1 Sege å, vid Brännemölla, uppströms Svedala AR44489","1  Sege å, vid Brännemölla, uppströms Svedala AR10",3,"1  Sege å, vid Brännemölla, uppströms Svedala AR","2021-10-20","",11.5,7.5,69,7.62,76,54.5,5.7,21,210,5600,48,7700,"","","",1400,""]
["1 Sege å, vid Brännemölla, uppströms Svedala AR44550","1  Sege å, vid Brännemölla, uppströms Svedala AR12",3,"1  Sege å, vid Brännemölla, uppströms Svedala AR","2021-12-20","",1.3,10.5,74,7.58,20,45.8,5.8,24,120,1900,650,4400,"","","",1430,""]
{"$rows_left_out":163}
{"sheet":"Sorterat","index":3,"n_rows":155,"n_cols":53,"rows_kept":155,"cut":false,"hidden":false,"merged":[[4,22,4,23]]}
[]
[null,"Sege å 2021"]
[null,"Sorterat per provpunkt"]
[null,null,null,"Värden < a räknas som a vid beräkning av statistik",null,null,null,null,null,null,null,null,null,null,null,null,null,null,null,null,null,null,null,null,null,null,null,null,null,null,null,null,null,null,"<-värden omvandlade till värden. Medelvärde hämtas här"]
["Sorterings-","Provtagningspunkt","Provtagn"," Vattenf"," Temp"," Syreh","Syrem","  pH","Gruml","  Kond","BOD7","TOC","Tot-P"," NO3+2-N","NH4-N"," Tot-N","Klor a","Siktdj VK","Siktdj","   Tid","Anmärkning","provtagare/projektledare",null,null,null,null,null,null,null,null,null,null,null,null," Vattenf"," Temp"," Syreh","Syrem","  pH","Gruml","  Kond","BOD7","PO4-P","Tot-P"," NO3+2-N","NH4-N"," Tot-N","Abs,filt","Klor a","Siktdjup","Het-bakt.","E coli","Int.het."]
["ordning","Nr Läge","datum","    m3/s","  °C","mg/l","%",null,"  FNU","mS/m","mg/l","mg/l"," µg/l","  µg/l","  µg/l","  µg/l","mg/m3","m","m",null,null,null,null,null,null,null,null,null,null,null,null,null,null,null,"    m3/s","  °C","mg/l","%",null,"  FNU","mS/m","mg/l"," µg/l"," µg/l","  µg/l","  µg/l","  µg/l","/5cm","mg/m3","m","cfu/ml","cfu/100ml","cfu/100 ml"]
[3,"1  Sege å, vid Brännemölla, uppströms Svedala AR","2021-02-15","",0.4,14,97,7.78,12,50.4,4.9000000000000004,22,65,1800,250,3600,"","","",1545,"is i kanten ",null,null,null,null,null,null,null,null,null,null,null,null,null,"",0.4,14,97,7.78,12,50.4,{"$f":"IF(OR(LEFT(K7,1)=\"<\",LEFT(K7,1)=\">\"),VALUE(MID(K7,2,5)),K7)","v":4.9000000000000004},{"$f":"IF(OR(LEFT(L7,1)=\"<\",LEFT(L7,1)=\">\"),VALUE(MID(L7,2,5)),L7)","v":22},{"$f":"IF(OR(LEFT(M7,1)=\"<\",LEFT(M7,1)=\">\"),VALUE(MID(M7,2,5)),M7)","v":65},{"$f":"IF(OR(LEFT(N7,1)=\"<\",LEFT(N7,1)=\">\"),VALUE(MID(N7,2,5)),N7)","v":1800},{"$f":"IF(OR(LEFT(O7,1)=\"<\",LEFT(O7,1)=\">\"),VALUE(MID(O7,2,5)),O7)","v":250},{"$f":"IF(OR(LEFT(P7,1)=\"<\",LEFT(P7,1)=\">\"),VALUE(MID(P7,2,5)),P7)","v":3600},{"$f":"IF(OR(LEFT(Q7,1)=\"<\",LEFT(Q7,1)=\">\"),VALUE(MID(Q7,2,5)),Q7)","v":""},{"$f":"IF(OR(LEFT(R7,1)=\"<\",LEFT(R7,1)=\">\"),VALUE(MID(R7,2,5)),R7)","v":""},{"$f":"IF(OR(LEFT(S7,1)=\"<\",LEFT(S7,1)=\">\"),VALUE(MID(S7,2,5)),S7)","v":""},{"$f":"IF(OR(LEFT(#REF!,1)=\"<\",LEFT(#REF!,1)=\">\"),VALUE(MID(#REF!,2,5)),#REF!)","v":{"$error":"#REF!"}},{"$f":"IF(OR(LEFT(#REF!,1)=\"<\",LEFT(#REF!,1)=\">\"),VALUE(MID(#REF!,2,5)),#REF!)","v":{"$error":"#REF!"}},{"$f":"IF(OR(LEFT(#REF!,1)=\"<\",LEFT(#REF!,1)=\">\"),VALUE(MID(#REF!,2,5)),#REF!)","v":{"$error":"#REF!"}}]
[3,"1  Sege å, vid Brännemölla, uppströms Svedala AR","2021-04-19","",9.8000000000000007,11.2,99,7.81,11,47.7,6.3,22,66,1300,"<10",2900,"","","",1050,"grumligt ",null,null,null,null,null,null,null,null,null,null,null,null,null,"",9.8000000000000007,11.2,99,7.81,11,47.7,6.3,22,66,1300,10,2900,"","","",{"$f":"IF(OR(LEFT(#REF!,1)=\"<\",LEFT(#REF!,1)=\">\"),VALUE(MID(#REF!,2,5)),#REF!)","v":{"$error":"#REF!"}},{"$f":"IF(OR(LEFT(#REF!,1)=\"<\",LEFT(#REF!,1)=\">\"),VALUE(MID(#REF!,2,5)),#REF!)","v":{"$error":"#REF!"}},{"$f":"IF(OR(LEFT(#REF!,1)=\"<\",LEFT(#REF!,1)=\">\"),VALUE(MID(#REF!,2,5)),#REF!)","v":{"$error":"#REF!"}}]
{"$rows_left_out":148}
{"sheet":"Stn 18","index":4,"n_rows":59,"n_cols":8,"rows_kept":59,"cut":false,"hidden":false,"merged":[]}
[]
["Sege å"]
["Veckoprov stn 18"]
[]
["Provtagningspunkt","Vecka ","Provtagn."," Temp"," Syreh","Syrem","Kond","Anmärkning"]
["Nr Läge","nr","datum","  °C","  mg/l","   %","mS/m"]
["18 Sege å, nordväst Valdemarsro, järnvägsbron",1,"2021-01-05",2,12.6,91,78.5]
["18 Sege å, nordväst Valdemarsro, järnvägsbron",2,"2021-01-12",3.9,12,91,69.8]
{"$rows_left_out":52}
{"sheet":"Vattenföring","index":5,"n_rows":467,"n_cols":9,"rows_kept":467,"cut":false,"hidden":false,"merged":[]}
[]
["Sege å"]
["Vattenföring"]
[]
[]
["Provtagnings-","Svedala, mätstation"]
["datum","m3/s"]
["2021-02-15",0.48599999999999999]
{"$rows_left_out":460}
{"sheet":"Statistik","index":6,"n_rows":81,"n_cols":93,"rows_kept":81,"cut":false,"hidden":false,"merged":[]}
[null,"Sege å, Vattenkontroll - Statistik"]
[]
[null,{"$f":"CONCATENATE(\"Statistik för åren: \",MIN(Q:Q),\" - \",MAX(Q:Q))","v":"Statistik för åren: 2011 - 2020"}]
[null,"(kan vara annorlunda för vissa parametrar)"]
[]
[null,null,null,null,null,null,null,null,null,null,null,null,null,null,null,null,null,null,null,null,null,null,null,null,null,null,"Stödlinjer i diagram-->",null,null,null,null,null,null,null,null,null,null,null,null,null,null,null,null,null,null,null,null,null,null,null,null,null,null,null,null,null,null,null,null,null,null,null,null,null,null,null,null,null,null,null,null,null,null,null,null,null,null,null,null,null,null,"Värden omvandlade för statisitk -->"]
[null,null,null,"  °C","mg/l","%",null,"  FNU","mS/m","mg/l"," µg/l"," µg/l","  µg/l","  µg/l","  µg/l",null,null,null,null,null,null,null,null,null,null,null,"Syre",null,null,null,"pH",null,null,null,"Turb",null,null,null,"Kond",null,null,"BOD",null,null,"PO4-P",null,null,"Tot_P",null,null,null,"NO2,3-N",null,null,"NH4-N",null,null,"Tot-N",null,null,null,null,null,null,null,null,null,null,null,null,null,null,null,null,null,null,null,null,null,null,null,"  °C","mg/l","%",null,"  FNU","mS/m","mg/l"," µg/l"," µg/l","  µg/l","  µg/l","  µg/l"]
[null,{"$f":"INDEX(Provpunkter!B1:B16,Provpunkter!G1)","v":"1  Sege å, vid Brännemölla, uppströms Svedala AR"},"Datum"," Temp"," Syrehalt","Syrem","  pH","Gruml","Kond","BOD7","PO4-P","Tot-P"," NO3+2-N","NH4-N"," Tot-N",null,"År","Månad",null,null,null,null,null,null,null,null,"Medel","+/- 1 std","- 1 std","Klass 4","Medel","+/- 1 std","- 1 std","Klass 3","Medel","+/- 1 std","- 1 std","Klass 5","Medel","+/- 1 std","- 1 std","Medel","+/- 1 std","- 1 std","Medel","+/- 1 std","- 1 std","Medel","+/- 1 std","- 1 std","Klass 5","Medel","+/- 1 std","- 1 std","Medel","+/- 1 std","- 1 std","Medel","+/- 1 std","- 1 std","Klass 5",null,null,"Test datum ",null,null,null,null,null,null,null,null,null,null,null,null,null,null,null,null,null," Temp"," Syrehalt","Syrem","  pH","Gruml","Kond","BOD","PO4-P","Tot-P"," NO3+2-N","NH4-N"," Tot-N"]
{"$rows_left_out":74}
{"sheet":"Diagram","index":7,"n_rows":182,"n_cols":45,"rows_kept":182,"cut":false,"hidden":false,"merged":[]}
[]
[]
[null,null,"Provpunkt:",null,null,null,null,null,null,null,null,null,null,null,null,null,null,"Senaste provtagningsdatum",null,null,null,null,null,null,null,null,null,null,null,null,null,null,null,null,null,null,null,null,null,null,null,null,null,"Senaste provtagningsdatum"]
[null,null,{"$f":"Statistik!$B8","v":"1  Sege å, vid Brännemölla, uppströms Svedala AR"},null,null,null,null,"Statistik för:",{"$f":"MIN(Statistik!$C10:$C72)","v":"2011-02-22"},"-",{"$f":"MAX(Statistik!$C10:$C72)","v":"2020-12-14"},null,null,null,null,null,null,{"$f":"IF((VLOOKUP(C4,Provpunkter!B1:C16,2,FALSE))=6,MAX(RS!E1:E8),IF((VLOOKUP(C4,Provpunkter!B1:C16,2,FALSE))=5,MAX(RS!E57:E61),RS!E77))","v":"2021-12-20"},null,null,null,null,null,null,null,null,null,null,null,null,null,null,null,null,null,null,null,null,null,null,null,null,null,"2021-02-15"]
[]
[]
[null,null,null,null,null,null,null,null,null,null,null,null,"Syre","halt",null,"mättnad",null,"Årets resultat",null,null,null,null,null,null,null,null,null,null,null,null,null,null,null,null,null,null,null,null,null,null,null,null,null,"Årets resultat"]
[null,null,null,null,null,null,null,null,null,null,null,null,null,"mg/l",null,"%",null,"Datum","mg/l","%",null,null,null,null,null,null,null,null,null,null,null,null,null,null,null,null,null,null,null,null,null,null,null,"Datum","mg/l"]
{"$rows_left_out":175}
{"sheet":"Hist_data","index":8,"n_rows":792,"n_cols":18,"rows_kept":792,"cut":false,"hidden":true,"merged":[]}
[null,null,"sista rad",1084,"OBS! Om det blir fler än 2000 rader måste makro ändras"]
[null,"Sege å"]
[null,"Vattenkontroll - historiska data"]
[null,null,null,"  °C","mg/l","%",null,"  FNU","mS/m","mg/l"," mg/l"," µg/l","  µg/l","  µg/l","  µg/l"]
["Sorterings-","Provtagningspunkt","Datum"," Temp"," Syreh","Syrem","  pH","Gruml","  Kond","BOD7","TOC","Tot-P"," NO3+2-N","NH4-N"," Tot-N","Anmärkning","år","månad"]
[null,"Denna rad ska vara tom"]
[3,"1  Sege å, vid Brännemölla, uppströms Svedala AR","2011-02-22",1.3,10.6,75.138706723078869,7.41,8.8000000000000007,39.799999999999997,5.8,21,61,1900,350,3400,"isfritt",{"$f":"YEAR(C7)","v":2011},{"$f":"MONTH(C7)","v":2}]
[3,"1  Sege å, vid Brännemölla, uppströms Svedala AR","2011-04-11",10.5,11.6,104.33957292161482,8.18,19,39.799999999999997,9.8000000000000007,22,120,940,72,3100,"gröngrumligt",2011,4]
{"$rows_left_out":785}
{"sheet":"Rapport","index":9,"n_rows":113,"n_cols":21,"rows_kept":113,"cut":false,"hidden":false,"merged":[]}
[null,"Sege å\nRapport"]
[null,"Metoder och mätosäkerhet"]
[null,"Sege å 2021"]
[null,"Vattenkontroll "]
[null,"På uppdrag av Segeåns Vattendragsförbund "]
[null,"och Vattenråd"]
["Sorterings-","Provtagningspunkt","Provtagn"," Vattenf"," Temp"," Syreh","Syrem","  pH","Gruml","  Kond","BOD7","TOC","Tot-P"," NO3+2-N","NH4-N"," Tot-N","Klor a","Siktdj VK","Siktdj","   Tid","Anmärkning"]
["ordning","Nr Läge","datum","    m3/s","  °C","mg/l","%",null,"  FNU","mS/m","mg/l","mg/l"," µg/l","  µg/l","  µg/l","  µg/l","mg/m3","m","m"]
{"$rows_left_out":106}
{"sheet":"Kommentarer","index":10,"n_rows":132,"n_cols":4,"rows_kept":132,"cut":false,"hidden":false,"merged":[]}
[]
[null,"Sege å"]
[null,"Vattenkontroll - Kommentarer till resultat"]
[]
[null," "]
[null,null,null,"Så här skriver du ut!"]
[null,null,null,"Klicka på aktuell månad till vänster\nObservera att sidbrytningar kan bli olika beroende på skrivare och skrivarinställningar"]
[]
{"$rows_left_out":125}
{"sheet":"Kontakt","index":11,"n_rows":19,"n_cols":4,"rows_kept":19,"cut":false,"hidden":false,"merged":[[20,3,21,3],[22,3,23,3]]}
[null,"Sege å"]
[null,"Vattenkontroll - kontaktpersoner"]
[]
[null,"Konsult:",null,"Uppdragsgivare:"]
[null,"Ekologigruppen AB",null,"Segeåns Vattendragsförbund och Vattenråd"]
[null,"Stora Södergatan 8C",null,"c/o Svedala kommun"]
[null,"222 23 Lund",null,"Bygg- och miljökontoret"]
[null,null,null,"Christel Strömsholm Trulsson"]
{"$rows_left_out":12}
{"sheet":"Länkar","index":12,"n_rows":19,"n_cols":6,"rows_kept":19,"cut":false,"hidden":false,"merged":[]}
[]
[null,"Sege å"]
[null,"Vattenkontroll - länkar till äldre resultat mm"]
[null,"Länkar till nationell databas, SLU (Sveriges LantbruksUniversitet). "]
[null,"Välj data från en eller flera stationer. Välj från stationskarta eller tabell."]
[null,"Internetuppkoppling krävs för denna funktion."]
[]
[null,"SLU, MVM*",null,"Vattendrag                 SLU                 t o m 2012",null,"Sjöar                SLU                 t o m 2012"]
{"$rows_left_out":12}
{"sheet":"Förklaring","index":13,"n_rows":48,"n_cols":8,"rows_kept":48,"cut":false,"hidden":false,"merged":[]}
[]
[null,"Sege"]
[null,"Vattenkontroll - förklaring till färgmarkeringar"]
[]
[null,"Indelning av halter och värden baseras på:"]
[null,"Bedömningsgrunder för miljökvalitet - Sjöar och Vattendrag "]
[null,"Naturvårdsverket 1999 (Rapport 4913)"]
[]
{"$rows_left_out":41}
{"sheet":"Versionshistorik","index":14,"n_rows":92,"n_cols":5,"rows_kept":92,"cut":false,"hidden":true,"merged":[]}
["Problem och versionsuppdateringar",null,null,"= Ej löst"]
[]
["Datum","Version","Problembeskrivning / uppdatering","Lösning","Sign"]
["Infoga nya rader under denna rad"]
[]
["2021-06-02","158","Överfört till Sege å.\nNy skrivarknapp på rapportfliken (endast införd i Sege å)",null,"BW"]
["2021-05-27","157","Resultatfliken visar inte värden som är 0 (t ex temp)","I formeln =OM(Rapport!D10=0;\"\";Rapport!D10) hämtas inte värden som är 0 i Rapport-fliken. Ändrat till att kolla efter tomma celler: =OM(Rapport!D10=\"\";\"\";","BW"]
["2021-05-05","156","Version före överföring till Höje å",null,"BW"]
{"$rows_left_out":85}
{"sheet":"Makron m m","index":15,"n_rows":44,"n_cols":5,"rows_kept":44,"cut":false,"hidden":true,"merged":[]}
["OBS!","Makrohanteraren är skyddad, för att få fram makron gäller lösenordet \"kontroll\""]
["Modul","Namn","Funktion","Använd i","Övrigt"]
["Färgmarkering","Färg ()","Används för att färgmarkera Syre, pH, Gruml, Tot-P, Tot-N\nTillagd funktion öppnar blad och skyddar blad. För att bladet ska kunna vara skyddat","Resultat, Sorterat","Syre, pH, Grum, Tot-P, Tot-N\nOBS! Kolumnnamn kan behöva ändras i makron\nDenna makro funkar både på punkt och komma"]
[null,"Avmarkera ()","Används för att avmarkera\nTillagd funktion öppnar blad och skyddar blad. För att bladet ska kunna vara skyddat","Resultat, Sorterat","Syre, pH, Grum, Tot-P, Tot-N\nOBS! Kolumnnamn kan behöva ändras i makron"]
["Utskrifter","JANutskrift ()\nFEButskrift ….","Skriva ut rapport","Rapport","Områden behöver ställas in för varje månad"]
[null,"JAN_rapp ()\nFEB_rapp ….","Hoppar till rätt månad på Rapportsidan","Rapport","Rad behöver ställas in för varje månad"]
[null,"JAN_kom ()\nFEB_kom ….","Hoppar till rätt månad på Kommentarsidan och frågar om man vill skriva ut","Kommentar","Startrad och områden behöver ställas in för varje månad"]
["Sorterat","NY_Sortering ()","Flyttar data från ett blad till ett annat och sorterar","Resultat (och flyttar till RS)","Områden kan behöva justeras.\nTillåter sortering på dolt blad (makron tar fram och döljer bladet)"]
{"$rows_left_out":37}
{"sheet":"Provpunkter","index":16,"n_rows":16,"n_cols":7,"rows_kept":16,"cut":false,"hidden":true,"merged":[]}
[1,"1  Sege å, vid Brännemölla, uppströms Svedala AR",6,null,null,null,1]
[2,"2  Sege å, söder Krågeholm, nedströms Svedala AR",6]
[3,"9  Sege å, vid Lilla Mölleberga",6]
[4,"18 Sege å, nordväst Valdemarsro, järnvägsbron",6]
[5,"21 Spångholmsbäcken, vid utlopp till Sege å",6]
[6,"22b Spångholmsbäcken, bron vid Torupsvägen",6]
[7,"23 Spångholmsbäcken, uppströms Torupsdammen",6]
[8,"10 Torrebergabäcken, vägbron nordost Mölleberga",6]
{"$rows_left_out":9}
{"sheet":"Formler","index":17,"n_rows":7,"n_cols":42,"rows_kept":7,"cut":false,"hidden":true,"merged":[[3,25,3,26]]}
["Detta blad används endast av Ekologgruppens personal. Bladet är skrivskyddat."]
["Formler för syremättnad"]
["Kopiera cellerna i kolumn F-H på rad 5 till de rader i bladet Resultat där syremättnad och alkalinitet ska beräknas"]
["Sorterings-","Provtagningspunkt","Provtagn"," Vattenf"," Temp"," Syreh","Syrem","  pH"," Alkalin","Gruml","  Kond","BOD7","PO4-P","Tot-P"," NO3+2-N","NH4-N"," Tot-N","Abs,filt","provtagare/projektledare","Klor a","Siktdjup","Het-bakt.","E coli","Anmärkning",null,null,null,"provp","SNV","2009-2011","2009-2011","provp","SNV","2009-2011","2009-2011",null,null,"provvolym","HCL,förbruk",null,null,"  mol/l"]
[null,null,null,null,null,null,{"$f":"ROUND((F5/((9.266*EXP(-0.04555*E5)+5.374))*100),0)","v":0},null,null,null,null,null,null,null,null,null,null,null,null,null,null,null,null,null,null,null,null,null,null,null,null,null,null,null,null,null,null,null,null,null,null,0.02]
[null,null,null,null,null,null,"Kopiera cell G ovan till fliken resultat"]
[null,null,null,null,null,null,"Ersätt sedan med värde"]